BDBM50049313 2-Dimethylamino-N-{3-(1H-indol-3-yl)-2-[2-(4-phenyl-piperazin-1-yl)-acetylamino]-propyl}-N-(2-methoxy-benzyl)-acetamide::CHEMBL350151
SMILES: COc1ccccc1CN(CC(Cc1c[nH]c2ccccc12)NC(=O)CN1CCN(CC1)c1ccccc1)C(=O)CN(C)C
InChI Key: InChIKey=BPOJDIXXCVFYFB-UHFFFAOYSA-N
Data: 3 IC50
Activity Spreadsheet -- Enzyme Inhibition Constant Data from BindingDB
Found 3 hits for monomerid = 50049313
Trg + Lig
Ki
nM
ΔG°
kcal/mole
IC50
nM
Kd
nM
EC50/IC50
nM
koff
s-1
kon
M-1s-1
pHTemp
°C
Neurokinin 1 receptor
(Mus musculus)
BDBM50049313
(2-Dimethylamino-N-{3-(1H-indol-3-yl)-2-[2-(4-pheny...)
Show SMILES COc1ccccc1CN(CC(Cc1c[nH]c2ccccc12)NC(=O)CN1CCN(CC1)c1ccccc1)C(=O)CN(C)C
Show InChI InChI=1S/C35H44N6O3/c1-38(2)26-35(43)41(23-27-11-7-10-16-33(27)44-3)24-29(21-28-22-36-32-15-9-8-14-31(28)32)37-34(42)25-39-17-19-40(20-18-39)30-12-5-4-6-13-30/h4-16,22,29,36H,17-21,23-26H2,1-3H3,(H,37,42)
Reactome pathway
n/an/a 200n/an/an/an/an/an/a
Lilly Research Laboratories
Curated by ChEMBL
Assay Description
Inhibitory activity of the compound against Tachykinin receptor 1 in mouse brain using [125I]-labeled Boltan-Hunter substance P as radioligand
J Med Chem 39: 736-48 (1996)
Article DOI: 10.1021/jm950616c
BindingDB Entry DOI: 10.7270/Q20864C7
Neurokinin 1 receptor
(Homo sapiens (Human))
BDBM50049313
(2-Dimethylamino-N-{3-(1H-indol-3-yl)-2-[2-(4-pheny...)
Show SMILES COc1ccccc1CN(CC(Cc1c[nH]c2ccccc12)NC(=O)CN1CCN(CC1)c1ccccc1)C(=O)CN(C)C
Show InChI InChI=1S/C35H44N6O3/c1-38(2)26-35(43)41(23-27-11-7-10-16-33(27)44-3)24-29(21-28-22-36-32-15-9-8-14-31(28)32)37-34(42)25-39-17-19-40(20-18-39)30-12-5-4-6-13-30/h4-16,22,29,36H,17-21,23-26H2,1-3H3,(H,37,42)
Reactome pathway
n/an/a 1.54n/an/an/an/an/an/a
Lilly Research Laboratories
Curated by ChEMBL
Assay Description
Inhibitory activity against Tachykinin receptor 1 in human IM-9 cells using [125I]-labeled Boltan-Hunter substance P as radioligand
J Med Chem 39: 736-48 (1996)
Article DOI: 10.1021/jm950616c
BindingDB Entry DOI: 10.7270/Q20864C7
Neurokinin 1 receptor
(Rattus norvegicus (rat))
BDBM50049313
(2-Dimethylamino-N-{3-(1H-indol-3-yl)-2-[2-(4-pheny...)
Show SMILES COc1ccccc1CN(CC(Cc1c[nH]c2ccccc12)NC(=O)CN1CCN(CC1)c1ccccc1)C(=O)CN(C)C
Show InChI InChI=1S/C35H44N6O3/c1-38(2)26-35(43)41(23-27-11-7-10-16-33(27)44-3)24-29(21-28-22-36-32-15-9-8-14-31(28)32)37-34(42)25-39-17-19-40(20-18-39)30-12-5-4-6-13-30/h4-16,22,29,36H,17-21,23-26H2,1-3H3,(H,37,42)
Reactome pathway
n/an/a 480n/an/an/an/an/an/a
Lilly Research Laboratories
Curated by ChEMBL
Assay Description
Inhibitory activity of the compound against Tachykinin receptor 1 in rat brain using [125I]-labeled Boltan-Hunter substance P as radioligand
J Med Chem 39: 736-48 (1996)
Article DOI: 10.1021/jm950616c
BindingDB Entry DOI: 10.7270/Q20864C7