BDBM50049318 CHEMBL351274::N-[(R)-1-{[Acetyl-(2-methoxy-benzyl)-amino]-methyl}-2-(1H-indol-3-yl)-ethyl]-2-(4-phenyl-piperazin-1-yl)-acetamide
SMILES: COc1ccccc1CN(C[C@@H](Cc1c[nH]c2ccccc12)NC(=O)CN1CCN(CC1)c1ccccc1)C(C)=O
InChI Key: InChIKey=ZCVDEBWDINFSGJ-MUUNZHRXSA-N
Data: 1 IC50  1 Kd
Activity Spreadsheet -- Enzyme Inhibition Constant Data from BindingDB
Found 2 hits for monomerid = 50049318
Trg + Lig
Ki
nM
ΔG°
kcal/mole
IC50
nM
Kd
nM
EC50/IC50
nM
koff
s-1
kon
M-1s-1
pHTemp
°C
Neurokinin 1 receptor
(Homo sapiens (Human))
BDBM50049318
(CHEMBL351274 | N-[(R)-1-{[Acetyl-(2-methoxy-benzyl...)
Show SMILES COc1ccccc1CN(C[C@@H](Cc1c[nH]c2ccccc12)NC(=O)CN1CCN(CC1)c1ccccc1)C(C)=O
Show InChI InChI=1S/C33H39N5O3/c1-25(39)38(22-26-10-6-9-15-32(26)41-2)23-28(20-27-21-34-31-14-8-7-13-30(27)31)35-33(40)24-36-16-18-37(19-17-36)29-11-4-3-5-12-29/h3-15,21,28,34H,16-20,22-24H2,1-2H3,(H,35,40)/t28-/m1/s1
Reactome pathway
n/an/an/a 1n/an/an/an/an/a
Lilly Research Laboratories
Curated by ChEMBL
Assay Description
Inhibition of substance P induced contraction of rabbit vena ceva (RVC) tissue expressing Tachykinin receptor 1
J Med Chem 39: 736-48 (1996)
Article DOI: 10.1021/jm950616c
BindingDB Entry DOI: 10.7270/Q20864C7
Neurokinin 1 receptor
(Homo sapiens (Human))
BDBM50049318
(CHEMBL351274 | N-[(R)-1-{[Acetyl-(2-methoxy-benzyl...)
Show SMILES COc1ccccc1CN(C[C@@H](Cc1c[nH]c2ccccc12)NC(=O)CN1CCN(CC1)c1ccccc1)C(C)=O
Show InChI InChI=1S/C33H39N5O3/c1-25(39)38(22-26-10-6-9-15-32(26)41-2)23-28(20-27-21-34-31-14-8-7-13-30(27)31)35-33(40)24-36-16-18-37(19-17-36)29-11-4-3-5-12-29/h3-15,21,28,34H,16-20,22-24H2,1-2H3,(H,35,40)/t28-/m1/s1
Reactome pathway
n/an/a 0.850n/an/an/an/an/an/a
Lilly Research Laboratories
Curated by ChEMBL
Assay Description
Inhibitory activity against Tachykinin receptor 1 in human IM-9 cells using [125I]-labeled Boltan-Hunter substance P as radioligand
J Med Chem 39: 736-48 (1996)
Article DOI: 10.1021/jm950616c
BindingDB Entry DOI: 10.7270/Q20864C7