BDBM50049319 CHEMBL42407::Lanepitant::N-[(R)-1-{[Acetyl-(2-methoxy-benzyl)-amino]-methyl}-2-(1H-indol-3-yl)-ethyl]-2-[1,4']bipiperidinyl-1'-yl-acetamide
SMILES: COc1ccccc1CN(C[C@@H](Cc1c[nH]c2ccccc12)NC(=O)CN1CCC(CC1)N1CCCCC1)C(C)=O
InChI Key: InChIKey=CVXJAPZTZWLRBP-MUUNZHRXSA-N
Data: 2 IC50  3 Kd
Activity Spreadsheet -- Enzyme Inhibition Constant Data from BindingDB
Found 5 hits for monomerid = 50049319
Trg + Lig
Ki
nM
ΔG°
kcal/mole
IC50
nM
Kd
nM
EC50/IC50
nM
koff
s-1
kon
M-1s-1
pHTemp
°C
Neurokinin 2 receptor
(Oryctolagus cuniculus)
BDBM50049319
(CHEMBL42407 | Lanepitant | N-[(R)-1-{[Acetyl-(2-me...)
Show SMILES COc1ccccc1CN(C[C@@H](Cc1c[nH]c2ccccc12)NC(=O)CN1CCC(CC1)N1CCCCC1)C(C)=O
Show InChI InChI=1S/C33H45N5O3/c1-25(39)38(22-26-10-4-7-13-32(26)41-2)23-28(20-27-21-34-31-12-6-5-11-30(27)31)35-33(40)24-36-18-14-29(15-19-36)37-16-8-3-9-17-37/h4-7,10-13,21,28-29,34H,3,8-9,14-20,22-24H2,1-2H3,(H,35,40)/t28-/m1/s1
Reactome pathway
n/an/an/a 2.00E+4n/an/an/an/an/a
Lilly Research Laboratories
Curated by ChEMBL
Assay Description
Inhibition of neurokinin A induced contraction of rabbit pulmonary artery (RPA) tissue expressing Tachykinin receptor 2
J Med Chem 39: 736-48 (1996)
Article DOI: 10.1021/jm950616c
BindingDB Entry DOI: 10.7270/Q20864C7
Neurokinin 1 receptor
(Homo sapiens (Human))
BDBM50049319
(CHEMBL42407 | Lanepitant | N-[(R)-1-{[Acetyl-(2-me...)
Show SMILES COc1ccccc1CN(C[C@@H](Cc1c[nH]c2ccccc12)NC(=O)CN1CCC(CC1)N1CCCCC1)C(C)=O
Show InChI InChI=1S/C33H45N5O3/c1-25(39)38(22-26-10-4-7-13-32(26)41-2)23-28(20-27-21-34-31-12-6-5-11-30(27)31)35-33(40)24-36-18-14-29(15-19-36)37-16-8-3-9-17-37/h4-7,10-13,21,28-29,34H,3,8-9,14-20,22-24H2,1-2H3,(H,35,40)/t28-/m1/s1
Reactome pathway
n/an/a 0.150n/an/an/an/an/an/a
Lilly Research Laboratories
Curated by ChEMBL
Assay Description
Inhibitory activity against Tachykinin receptor 1 in human IM-9 cells using [125I]-labeled Boltan-Hunter substance P as radioligand
J Med Chem 39: 736-48 (1996)
Article DOI: 10.1021/jm950616c
BindingDB Entry DOI: 10.7270/Q20864C7
Neurokinin 3 receptor
(Rattus norvegicus)
BDBM50049319
(CHEMBL42407 | Lanepitant | N-[(R)-1-{[Acetyl-(2-me...)
Show SMILES COc1ccccc1CN(C[C@@H](Cc1c[nH]c2ccccc12)NC(=O)CN1CCC(CC1)N1CCCCC1)C(C)=O
Show InChI InChI=1S/C33H45N5O3/c1-25(39)38(22-26-10-4-7-13-32(26)41-2)23-28(20-27-21-34-31-12-6-5-11-30(27)31)35-33(40)24-36-18-14-29(15-19-36)37-16-8-3-9-17-37/h4-7,10-13,21,28-29,34H,3,8-9,14-20,22-24H2,1-2H3,(H,35,40)/t28-/m1/s1
Reactome pathway
n/an/an/a 2.00E+4n/an/an/an/an/a
Lilly Research Laboratories
Curated by ChEMBL
Assay Description
Inhibition of neurokinin B induced contraction of rat portal vein (RPV) tissue expressing Tachykinin receptor 3
J Med Chem 39: 736-48 (1996)
Article DOI: 10.1021/jm950616c
BindingDB Entry DOI: 10.7270/Q20864C7
Neurokinin 1 receptor
(Homo sapiens (Human))
BDBM50049319
(CHEMBL42407 | Lanepitant | N-[(R)-1-{[Acetyl-(2-me...)
Show SMILES COc1ccccc1CN(C[C@@H](Cc1c[nH]c2ccccc12)NC(=O)CN1CCC(CC1)N1CCCCC1)C(C)=O
Show InChI InChI=1S/C33H45N5O3/c1-25(39)38(22-26-10-4-7-13-32(26)41-2)23-28(20-27-21-34-31-12-6-5-11-30(27)31)35-33(40)24-36-18-14-29(15-19-36)37-16-8-3-9-17-37/h4-7,10-13,21,28-29,34H,3,8-9,14-20,22-24H2,1-2H3,(H,35,40)/t28-/m1/s1
Reactome pathway
n/an/an/a 0.398n/an/an/an/an/a
Lilly Research Laboratories
Curated by ChEMBL
Assay Description
Inhibition of substance P induced contraction of rabbit vena ceva (RVC) tissue expressing Tachykinin receptor 1
J Med Chem 39: 736-48 (1996)
Article DOI: 10.1021/jm950616c
BindingDB Entry DOI: 10.7270/Q20864C7
Neurokinin 1 receptor
(Homo sapiens (Human))
BDBM50049319
(CHEMBL42407 | Lanepitant | N-[(R)-1-{[Acetyl-(2-me...)
Show SMILES COc1ccccc1CN(C[C@@H](Cc1c[nH]c2ccccc12)NC(=O)CN1CCC(CC1)N1CCCCC1)C(C)=O
Show InChI InChI=1S/C33H45N5O3/c1-25(39)38(22-26-10-4-7-13-32(26)41-2)23-28(20-27-21-34-31-12-6-5-11-30(27)31)35-33(40)24-36-18-14-29(15-19-36)37-16-8-3-9-17-37/h4-7,10-13,21,28-29,34H,3,8-9,14-20,22-24H2,1-2H3,(H,35,40)/t28-/m1/s1
Reactome pathway
n/an/a 0.230n/an/an/an/an/an/a
Lilly Research Laboratories
Curated by ChEMBL
Assay Description
In vitro inhibition of binding of [125I]-Bolton-Hunter SP to Tachykinin receptor 1 in human IM-9 cell line
Bioorg Med Chem Lett 11: 1643-6 (2001)
BindingDB Entry DOI: 10.7270/Q2GQ6X13