BDBM50049446 CHEMBL3356465
SMILES: CC1N2C(COc3cc(F)c(NC4CNC4)cc23)=NNC1=O
InChI Key: InChIKey=QHQLQDMBLMLIEA-UHFFFAOYSA-N
Data: 2 IC50
Activity Spreadsheet -- Enzyme Inhibition Constant Data from BindingDB
Found 2 hits for monomerid = 50049446
Trg + Lig
Ki
nM
ΔG°
kcal/mole
IC50
nM
Kd
nM
EC50/IC50
nM
koff
s-1
kon
M-1s-1
pHTemp
°C
Protein kinase C theta type
(Homo sapiens (Human))
BDBM50049446
(CHEMBL3356465)
Show SMILES CC1N2C(COc3cc(F)c(NC4CNC4)cc23)=NNC1=O |c:20|
Show InChI InChI=1S/C14H16FN5O2/c1-7-14(21)19-18-13-6-22-12-2-9(15)10(3-11(12)20(7)13)17-8-4-16-5-8/h2-3,7-8,16-17H,4-6H2,1H3,(H,19,21)
NCI pathway
Reactome pathway
n/an/a 100n/an/an/an/an/an/a
AbbVie Bioresearch Center
Curated by ChEMBL
Assay Description
Inhibition of human recombinant PKCtheta expressed in Sf21 cells using Bio-cdc peptide substrate and ATP after 60 mins by time-resolved fluorescence ...
J Med Chem 58: 222-36 (2015)
Article DOI: 10.1021/jm500669m
BindingDB Entry DOI: 10.7270/Q22F7Q2Z
Protein kinase C alpha type
(Homo sapiens (Human))
BDBM50049446
(CHEMBL3356465)
Show SMILES CC1N2C(COc3cc(F)c(NC4CNC4)cc23)=NNC1=O |c:20|
Show InChI InChI=1S/C14H16FN5O2/c1-7-14(21)19-18-13-6-22-12-2-9(15)10(3-11(12)20(7)13)17-8-4-16-5-8/h2-3,7-8,16-17H,4-6H2,1H3,(H,19,21)
NCI pathway
Reactome pathway
n/an/a 6.90E+3n/an/an/an/an/an/a
AbbVie Bioresearch Center
Curated by ChEMBL
Assay Description
Inhibition of human recombinant PKCalpha expressed in Sf21 cells using Bio-cdc peptide substrate and ATP after 60 mins by time-resolved fluorescence ...
J Med Chem 58: 222-36 (2015)
Article DOI: 10.1021/jm500669m
BindingDB Entry DOI: 10.7270/Q22F7Q2Z