BDBM50049451 CHEMBL3356456
SMILES: O=C(Nc1ccc2OCC3=NNC(=O)CN3c2c1)C1CNC1
InChI Key: InChIKey=ASHFYOXZMVRNTM-UHFFFAOYSA-N
Data: 1 IC50
Activity Spreadsheet -- Enzyme Inhibition Constant Data from BindingDB
Found 1 hit for monomerid = 50049451
Trg + Lig
Ki
nM
ΔG°
kcal/mole
IC50
nM
Kd
nM
EC50/IC50
nM
koff
s-1
kon
M-1s-1
pHTemp
°C
Protein kinase C theta type
(Homo sapiens (Human))
BDBM50049451
(CHEMBL3356456)
Show SMILES O=C(Nc1ccc2OCC3=NNC(=O)CN3c2c1)C1CNC1 |t:9|
Show InChI InChI=1S/C14H15N5O3/c20-13-6-19-10-3-9(16-14(21)8-4-15-5-8)1-2-11(10)22-7-12(19)17-18-13/h1-3,8,15H,4-7H2,(H,16,21)(H,18,20)
NCI pathway
Reactome pathway
n/an/a 1.90E+4n/an/an/an/an/an/a
AbbVie Bioresearch Center
Curated by ChEMBL
Assay Description
Inhibition of human recombinant PKCtheta expressed in Sf21 cells using Bio-cdc peptide substrate and ATP after 60 mins by time-resolved fluorescence ...
J Med Chem 58: 222-36 (2015)
Article DOI: 10.1021/jm500669m
BindingDB Entry DOI: 10.7270/Q22F7Q2Z