BDBM50049467 (2S,3S)-2-(3,5-Bis-trifluoromethyl-benzyloxy)-3-phenyl-4-(2H-[1,2,4]triazol-1-ylmethyl)-morpholine::CHEMBL406136
SMILES: FC(F)(F)c1cc(CO[C@H]2OCCN(Cn3cncn3)[C@H]2c2ccccc2)cc(c1)C(F)(F)F
InChI Key: InChIKey=KIPCSRVFBMVQSZ-VQTJNVASSA-N
Data: 1 IC50
Activity Spreadsheet -- Enzyme Inhibition Constant Data from BindingDB
Found 1 hit for monomerid = 50049467
Trg + Lig
Ki
nM
ΔG°
kcal/mole
IC50
nM
Kd
nM
EC50/IC50
nM
koff
s-1
kon
M-1s-1
pHTemp
°C
Substance-P receptor
(Homo sapiens (Human))
BDBM50049467
((2S,3S)-2-(3,5-Bis-trifluoromethyl-benzyloxy)-3-ph...)
Show SMILES FC(F)(F)c1cc(CO[C@H]2OCCN(Cn3cncn3)[C@H]2c2ccccc2)cc(c1)C(F)(F)F
Show InChI InChI=1S/C22H20F6N4O2/c23-21(24,25)17-8-15(9-18(10-17)22(26,27)28)11-34-20-19(16-4-2-1-3-5-16)31(6-7-33-20)14-32-13-29-12-30-32/h1-5,8-10,12-13,19-20H,6-7,11,14H2/t19-,20+/m0/s1
Reactome pathway
n/an/a 0.130n/an/an/an/an/an/a
Merck Research Laboratories
Curated by ChEMBL
Assay Description
Displacement of [125I]-labeled SP from human Tachykinin receptor 1 expressed in CHO cells
J Med Chem 39: 1760-2 (1996)
Article DOI: 10.1021/jm950654w
BindingDB Entry DOI: 10.7270/Q2GB2346