BDBM50049488 5-Bromo-2-((1S,5R)-5-hydroxy-2,2,5-trimethyl-6-methylene-cyclohexylmethyl)-4-methoxy-phenol::CHEMBL50534
SMILES: COc1cc(C[C@@H]2C(=C)[C@](C)(O)CCC2(C)C)c(O)cc1Br
InChI Key: InChIKey=NTUAVXWCKQEOJQ-FZKQIMNGSA-N
Data: 3 KI  2 IC50
Activity Spreadsheet -- Enzyme Inhibition Constant Data from BindingDB
Found 5 hits for monomerid = 50049488
Trg + Lig
Ki
nM
ΔG°
kcal/mole
IC50
nM
Kd
nM
EC50/IC50
nM
koff
s-1
kon
M-1s-1
pHTemp
°C
Progesterone receptor
(Homo sapiens (Human))
BDBM50049488
(5-Bromo-2-((1S,5R)-5-hydroxy-2,2,5-trimethyl-6-met...)
Show SMILES COc1cc(C[C@@H]2C(=C)[C@](C)(O)CCC2(C)C)c(O)cc1Br
Show InChI InChI=1S/C18H25BrO3/c1-11-13(17(2,3)6-7-18(11,4)21)8-12-9-16(22-5)14(19)10-15(12)20/h9-10,13,20-21H,1,6-8H2,2-5H3/t13-,18-/m1/s1
275n/an/an/an/an/an/an/an/a
Ligand Pharmaceuticals, Inc.
Curated by ChEMBL
Assay Description
Binding affinity determined for human Progesterone receptor A isoform
J Med Chem 39: 1778-89 (1996)
Article DOI: 10.1021/jm950747d
BindingDB Entry DOI: 10.7270/Q2416XQ2
Androgen Receptor
(Homo sapiens (Human))
BDBM50049488
(5-Bromo-2-((1S,5R)-5-hydroxy-2,2,5-trimethyl-6-met...)
Show SMILES COc1cc(C[C@@H]2C(=C)[C@](C)(O)CCC2(C)C)c(O)cc1Br
Show InChI InChI=1S/C18H25BrO3/c1-11-13(17(2,3)6-7-18(11,4)21)8-12-9-16(22-5)14(19)10-15(12)20/h9-10,13,20-21H,1,6-8H2,2-5H3/t13-,18-/m1/s1
NCI pathway
Reactome pathway
6.66E+3n/an/an/an/an/an/an/an/a
Ligand Pharmaceuticals, Inc.
Curated by ChEMBL
Assay Description
Binding affinity determined against human Androgen receptor
J Med Chem 39: 1778-89 (1996)
Article DOI: 10.1021/jm950747d
BindingDB Entry DOI: 10.7270/Q2416XQ2
Glucocorticoid receptor
(Homo sapiens (Human))
BDBM50049488
(5-Bromo-2-((1S,5R)-5-hydroxy-2,2,5-trimethyl-6-met...)
Show SMILES COc1cc(C[C@@H]2C(=C)[C@](C)(O)CCC2(C)C)c(O)cc1Br
Show InChI InChI=1S/C18H25BrO3/c1-11-13(17(2,3)6-7-18(11,4)21)8-12-9-16(22-5)14(19)10-15(12)20/h9-10,13,20-21H,1,6-8H2,2-5H3/t13-,18-/m1/s1
>1.00E+4n/an/an/an/an/an/an/an/a
Ligand Pharmaceuticals, Inc.
Curated by ChEMBL
Assay Description
Binding affinity was determined for human glucocorticoid receptor(hGR).
J Med Chem 39: 1778-89 (1996)
Article DOI: 10.1021/jm950747d
BindingDB Entry DOI: 10.7270/Q2416XQ2
Progesterone receptor
(Homo sapiens (Human))
BDBM50049488
(5-Bromo-2-((1S,5R)-5-hydroxy-2,2,5-trimethyl-6-met...)
Show SMILES COc1cc(C[C@@H]2C(=C)[C@](C)(O)CCC2(C)C)c(O)cc1Br
Show InChI InChI=1S/C18H25BrO3/c1-11-13(17(2,3)6-7-18(11,4)21)8-12-9-16(22-5)14(19)10-15(12)20/h9-10,13,20-21H,1,6-8H2,2-5H3/t13-,18-/m1/s1
n/an/a 2.00E+3n/an/an/an/an/an/a
Ligand Pharmaceuticals, Inc.
Curated by ChEMBL
Assay Description
Concentration required to give half-maximal inhibition against human Progesterone receptor B isoform in co-transfected CV-1 cell lines.
J Med Chem 39: 1778-89 (1996)
Article DOI: 10.1021/jm950747d
BindingDB Entry DOI: 10.7270/Q2416XQ2
Progesterone receptor
(Homo sapiens (Human))
BDBM50049488
(5-Bromo-2-((1S,5R)-5-hydroxy-2,2,5-trimethyl-6-met...)
Show SMILES COc1cc(C[C@@H]2C(=C)[C@](C)(O)CCC2(C)C)c(O)cc1Br
Show InChI InChI=1S/C18H25BrO3/c1-11-13(17(2,3)6-7-18(11,4)21)8-12-9-16(22-5)14(19)10-15(12)20/h9-10,13,20-21H,1,6-8H2,2-5H3/t13-,18-/m1/s1
n/an/a 430n/an/an/an/an/an/a
Ligand Pharmaceuticals, Inc.
Curated by ChEMBL
Assay Description
Antagonistic potency to the human progesterone receptor measured in the T-47D alkaline phosphatase assay
J Med Chem 39: 1778-89 (1996)
Article DOI: 10.1021/jm950747d
BindingDB Entry DOI: 10.7270/Q2416XQ2