null
SMILES: COc1cc(CC2C(=C)C=CCC2(C)C)c(O)cc1Br
InChI Key: InChIKey=JNOHYAULZURALP-UHFFFAOYSA-N
Activity Spreadsheet -- Enzyme Inhibition Constant Data from BindingDB
Found 5 hits for monomerid = 50049494
Trg + Lig
Ki
nM
ΔG°
kcal/mole
IC50
nM
Kd
nM
EC50/IC50
nM
koff
s-1
kon
M-1s-1
pHTemp
°C
Progesterone receptor
(Homo sapiens (Human))
BDBM50049494
(5-Bromo-2-(6,6-dimethyl-2-methylene-cyclohex-3-eny...)
Show SMILES COc1cc(CC2C(=C)C=CCC2(C)C)c(O)cc1Br |c:9|
Show InChI InChI=1S/C17H21BrO2/c1-11-6-5-7-17(2,3)13(11)8-12-9-16(20-4)14(18)10-15(12)19/h5-6,9-10,13,19H,1,7-8H2,2-4H3
n/an/a 280n/an/an/an/an/an/a
Ligand Pharmaceuticals, Inc.
Curated by ChEMBL
Assay Description
Antagonistic potency to the human progesterone receptor measured in the T-47D alkaline phosphatase assay
J Med Chem 39: 1778-89 (1996)
Article DOI: 10.1021/jm950747d
BindingDB Entry DOI: 10.7270/Q2416XQ2
Progesterone receptor
(Homo sapiens (Human))
BDBM50049494
(5-Bromo-2-(6,6-dimethyl-2-methylene-cyclohex-3-eny...)
Show SMILES COc1cc(CC2C(=C)C=CCC2(C)C)c(O)cc1Br |c:9|
Show InChI InChI=1S/C17H21BrO2/c1-11-6-5-7-17(2,3)13(11)8-12-9-16(20-4)14(18)10-15(12)19/h5-6,9-10,13,19H,1,7-8H2,2-4H3
156n/an/an/an/an/an/an/an/a
Ligand Pharmaceuticals, Inc.
Curated by ChEMBL
Assay Description
Binding affinity determined for human Progesterone receptor A isoform
J Med Chem 39: 1778-89 (1996)
Article DOI: 10.1021/jm950747d
BindingDB Entry DOI: 10.7270/Q2416XQ2
Progesterone receptor
(Homo sapiens (Human))
BDBM50049494
(5-Bromo-2-(6,6-dimethyl-2-methylene-cyclohex-3-eny...)
Show SMILES COc1cc(CC2C(=C)C=CCC2(C)C)c(O)cc1Br |c:9|
Show InChI InChI=1S/C17H21BrO2/c1-11-6-5-7-17(2,3)13(11)8-12-9-16(20-4)14(18)10-15(12)19/h5-6,9-10,13,19H,1,7-8H2,2-4H3
n/an/a 783n/an/an/an/an/an/a
Ligand Pharmaceuticals, Inc.
Curated by ChEMBL
Assay Description
Concentration required to give half-maximal inhibition against human Progesterone receptor B isoform in co-transfected CV-1 cell lines.
J Med Chem 39: 1778-89 (1996)
Article DOI: 10.1021/jm950747d
BindingDB Entry DOI: 10.7270/Q2416XQ2
Androgen receptor
(Homo sapiens (Human))
BDBM50049494
(5-Bromo-2-(6,6-dimethyl-2-methylene-cyclohex-3-eny...)
Show SMILES COc1cc(CC2C(=C)C=CCC2(C)C)c(O)cc1Br |c:9|
Show InChI InChI=1S/C17H21BrO2/c1-11-6-5-7-17(2,3)13(11)8-12-9-16(20-4)14(18)10-15(12)19/h5-6,9-10,13,19H,1,7-8H2,2-4H3
NCI pathway
Reactome pathway
1.52E+3n/an/an/an/an/an/an/an/a
Ligand Pharmaceuticals, Inc.
Curated by ChEMBL
Assay Description
Binding affinity determined against human Androgen receptor
J Med Chem 39: 1778-89 (1996)
Article DOI: 10.1021/jm950747d
BindingDB Entry DOI: 10.7270/Q2416XQ2
Glucocorticoid receptor
(Homo sapiens (Human))
BDBM50049494
(5-Bromo-2-(6,6-dimethyl-2-methylene-cyclohex-3-eny...)
Show SMILES COc1cc(CC2C(=C)C=CCC2(C)C)c(O)cc1Br |c:9|
Show InChI InChI=1S/C17H21BrO2/c1-11-6-5-7-17(2,3)13(11)8-12-9-16(20-4)14(18)10-15(12)19/h5-6,9-10,13,19H,1,7-8H2,2-4H3
2.78E+3n/an/an/an/an/an/an/an/a
Ligand Pharmaceuticals, Inc.
Curated by ChEMBL
Assay Description
Binding affinity was determined for human glucocorticoid receptor(hGR).
J Med Chem 39: 1778-89 (1996)
Article DOI: 10.1021/jm950747d
BindingDB Entry DOI: 10.7270/Q2416XQ2