BDBM50049567 CHEMBL53300::Quinazolin-6-ylamine
SMILES: Nc1ccc2ncncc2c1
InChI Key: InChIKey=XFGPXURFKAUHQR-UHFFFAOYSA-N
Data: 1 IC50
Activity Spreadsheet -- Enzyme Inhibition Constant Data from BindingDB
Found 1 hit for monomerid = 50049567
Trg + Lig
Ki
nM
ΔG°
kcal/mole
IC50
nM
Kd
nM
EC50/IC50
nM
koff
s-1
kon
M-1s-1
pHTemp
°C
Epidermal growth factor receptor
(Homo sapiens (Human))
BDBM50049567
(CHEMBL53300 | Quinazolin-6-ylamine)
Show SMILES Nc1ccc2ncncc2c1
Show InChI InChI=1S/C8H7N3/c9-7-1-2-8-6(3-7)4-10-5-11-8/h1-5H,9H2
n/an/a 0.790n/an/an/an/an/an/a
University of Auckland
Assay Description
Inhibitory potency against isolated epidermal growth factor receptor (EGFR) from human A431 carcinoma cells
J Med Chem 39: 1823-35 (1996)
Article DOI: 10.1021/jm9508651
BindingDB Entry DOI: 10.7270/Q2X928GF