BDBM50049583 6-[(Methyl-naphthalen-2-yl-amino)-methyl]-pyrido[3,2-d]pyrimidine-2,4-diamine::CHEMBL55727
SMILES: CN(Cc1ccc2nc(N)nc(N)c2n1)c1ccc2ccccc2c1
InChI Key: InChIKey=XVMYUHGKEGJVTF-UHFFFAOYSA-N
Data: 6 IC50
Activity Spreadsheet -- Enzyme Inhibition Constant Data from BindingDB
Found 6 hits for monomerid = 50049583
Trg + Lig
Ki
nM
ΔG°
kcal/mole
IC50
nM
Kd
nM
EC50/IC50
nM
koff
s-1
kon
M-1s-1
pHTemp
°C
Dihydrofolate reductase
(Saccharomyces cerevisiae)
BDBM50049583
(6-[(Methyl-naphthalen-2-yl-amino)-methyl]-pyrido[3...)
Show SMILES CN(Cc1ccc2nc(N)nc(N)c2n1)c1ccc2ccccc2c1
Show InChI InChI=1S/C19H18N6/c1-25(15-8-6-12-4-2-3-5-13(12)10-15)11-14-7-9-16-17(22-14)18(20)24-19(21)23-16/h2-10H,11H2,1H3,(H4,20,21,23,24)
Reactome pathway
n/an/a 52n/an/an/an/an/an/a
Duquesne University
Curated by ChEMBL
Assay Description
Inhibitory activity against Pneumocystis carinii dihydrofolate reductase.
J Med Chem 39: 1836-45 (1996)
Article DOI: 10.1021/jm950918e
BindingDB Entry DOI: 10.7270/Q2319TXB
Dihydrofolate reductase
(Rattus norvegicus (rat))
BDBM50049583
(6-[(Methyl-naphthalen-2-yl-amino)-methyl]-pyrido[3...)
Show SMILES CN(Cc1ccc2nc(N)nc(N)c2n1)c1ccc2ccccc2c1
Show InChI InChI=1S/C19H18N6/c1-25(15-8-6-12-4-2-3-5-13(12)10-15)11-14-7-9-16-17(22-14)18(20)24-19(21)23-16/h2-10H,11H2,1H3,(H4,20,21,23,24)
Reactome pathway
n/an/a 7.20n/an/an/an/an/an/a
Duquesne University
Curated by ChEMBL
Assay Description
Inhibitory activity against rat liver dihydrofolate reductase.
J Med Chem 39: 1836-45 (1996)
Article DOI: 10.1021/jm950918e
BindingDB Entry DOI: 10.7270/Q2319TXB
Dihydrofolate reductase
(Rattus norvegicus (rat))
BDBM50049583
(6-[(Methyl-naphthalen-2-yl-amino)-methyl]-pyrido[3...)
Show SMILES CN(Cc1ccc2nc(N)nc(N)c2n1)c1ccc2ccccc2c1
Show InChI InChI=1S/C19H18N6/c1-25(15-8-6-12-4-2-3-5-13(12)10-15)11-14-7-9-16-17(22-14)18(20)24-19(21)23-16/h2-10H,11H2,1H3,(H4,20,21,23,24)
Reactome pathway
n/an/a 7.20n/an/an/an/an/an/a
Duquesne University
Curated by ChEMBL
Assay Description
Inhibition of rat liver dihydrofolate reductase
J Med Chem 48: 1448-69 (2005)
Article DOI: 10.1021/jm040153n
BindingDB Entry DOI: 10.7270/Q2V40TQ3
Dihydrofolate Reductase (DHFR)
(Pneumocystis carinii)
BDBM50049583
(6-[(Methyl-naphthalen-2-yl-amino)-methyl]-pyrido[3...)
Show SMILES CN(Cc1ccc2nc(N)nc(N)c2n1)c1ccc2ccccc2c1
Show InChI InChI=1S/C19H18N6/c1-25(15-8-6-12-4-2-3-5-13(12)10-15)11-14-7-9-16-17(22-14)18(20)24-19(21)23-16/h2-10H,11H2,1H3,(H4,20,21,23,24)
n/an/a 52n/an/an/an/an/an/a
Duquesne University
Curated by ChEMBL
Assay Description
Inhibition of Pneumocystis carinii dihydrofolate reductase
J Med Chem 48: 1448-69 (2005)
Article DOI: 10.1021/jm040153n
BindingDB Entry DOI: 10.7270/Q2V40TQ3
Dihydrofolate reductase (DHFR)
(Toxoplasma gondii)
BDBM50049583
(6-[(Methyl-naphthalen-2-yl-amino)-methyl]-pyrido[3...)
Show SMILES CN(Cc1ccc2nc(N)nc(N)c2n1)c1ccc2ccccc2c1
Show InChI InChI=1S/C19H18N6/c1-25(15-8-6-12-4-2-3-5-13(12)10-15)11-14-7-9-16-17(22-14)18(20)24-19(21)23-16/h2-10H,11H2,1H3,(H4,20,21,23,24)
n/an/a 16n/an/an/an/an/an/a
Duquesne University
Curated by ChEMBL
Assay Description
Inhibition of Toxoplasma gondii dihydrofolate reductase
J Med Chem 48: 1448-69 (2005)
Article DOI: 10.1021/jm040153n
BindingDB Entry DOI: 10.7270/Q2V40TQ3
Dihydrofolate reductase (DHFR)
(Toxoplasma gondii)
BDBM50049583
(6-[(Methyl-naphthalen-2-yl-amino)-methyl]-pyrido[3...)
Show SMILES CN(Cc1ccc2nc(N)nc(N)c2n1)c1ccc2ccccc2c1
Show InChI InChI=1S/C19H18N6/c1-25(15-8-6-12-4-2-3-5-13(12)10-15)11-14-7-9-16-17(22-14)18(20)24-19(21)23-16/h2-10H,11H2,1H3,(H4,20,21,23,24)
n/an/a 16n/an/an/an/an/an/a
Duquesne University
Curated by ChEMBL
Assay Description
Inhibitory activity against Toxoplasma gondii dihydrofolate reductase.
J Med Chem 39: 1836-45 (1996)
Article DOI: 10.1021/jm950918e
BindingDB Entry DOI: 10.7270/Q2319TXB