BDBM50049611 6-[(Methyl-phenyl-amino)-methyl]-pyrido[3,2-d]pyrimidine-2,4-diamine::CHEMBL55063
SMILES: CN(Cc1ccc2nc(N)nc(N)c2n1)c1ccccc1
InChI Key: InChIKey=VLGOZDDHGVMTHG-UHFFFAOYSA-N
Data: 6 IC50
Activity Spreadsheet -- Enzyme Inhibition Constant Data from BindingDB
Found 6 hits for monomerid = 50049611
Trg + Lig
Ki
nM
ΔG°
kcal/mole
IC50
nM
Kd
nM
EC50/IC50
nM
koff
s-1
kon
M-1s-1
pHTemp
°C
Dihydrofolate reductase
(Rattus norvegicus (rat))
BDBM50049611
(6-[(Methyl-phenyl-amino)-methyl]-pyrido[3,2-d]pyri...)
Show SMILES CN(Cc1ccc2nc(N)nc(N)c2n1)c1ccccc1
Show InChI InChI=1S/C15H16N6/c1-21(11-5-3-2-4-6-11)9-10-7-8-12-13(18-10)14(16)20-15(17)19-12/h2-8H,9H2,1H3,(H4,16,17,19,20)
Reactome pathway
n/an/a 24n/an/an/an/an/an/a
Duquesne University
Curated by ChEMBL
Assay Description
Inhibitory activity against rat liver dihydrofolate reductase.
J Med Chem 39: 1836-45 (1996)
Article DOI: 10.1021/jm950918e
BindingDB Entry DOI: 10.7270/Q2319TXB
Dihydrofolate reductase (DHFR)
(Toxoplasma gondii)
BDBM50049611
(6-[(Methyl-phenyl-amino)-methyl]-pyrido[3,2-d]pyri...)
Show SMILES CN(Cc1ccc2nc(N)nc(N)c2n1)c1ccccc1
Show InChI InChI=1S/C15H16N6/c1-21(11-5-3-2-4-6-11)9-10-7-8-12-13(18-10)14(16)20-15(17)19-12/h2-8H,9H2,1H3,(H4,16,17,19,20)
n/an/a 8.40n/an/an/an/an/an/a
Duquesne University
Curated by ChEMBL
Assay Description
Inhibitory activity against Toxoplasma gondii dihydrofolate reductase.
J Med Chem 39: 1836-45 (1996)
Article DOI: 10.1021/jm950918e
BindingDB Entry DOI: 10.7270/Q2319TXB
Dihydrofolate Reductase (DHFR)
(Pneumocystis carinii)
BDBM50049611
(6-[(Methyl-phenyl-amino)-methyl]-pyrido[3,2-d]pyri...)
Show SMILES CN(Cc1ccc2nc(N)nc(N)c2n1)c1ccccc1
Show InChI InChI=1S/C15H16N6/c1-21(11-5-3-2-4-6-11)9-10-7-8-12-13(18-10)14(16)20-15(17)19-12/h2-8H,9H2,1H3,(H4,16,17,19,20)
n/an/a 290n/an/an/an/an/an/a
Duquesne University
Curated by ChEMBL
Assay Description
Inhibition of Pneumocystis carinii dihydrofolate reductase
J Med Chem 48: 1448-69 (2005)
Article DOI: 10.1021/jm040153n
BindingDB Entry DOI: 10.7270/Q2V40TQ3
Dihydrofolate reductase
(Rattus norvegicus (rat))
BDBM50049611
(6-[(Methyl-phenyl-amino)-methyl]-pyrido[3,2-d]pyri...)
Show SMILES CN(Cc1ccc2nc(N)nc(N)c2n1)c1ccccc1
Show InChI InChI=1S/C15H16N6/c1-21(11-5-3-2-4-6-11)9-10-7-8-12-13(18-10)14(16)20-15(17)19-12/h2-8H,9H2,1H3,(H4,16,17,19,20)
Reactome pathway
n/an/a 24n/an/an/an/an/an/a
Duquesne University
Curated by ChEMBL
Assay Description
Inhibition of rat liver dihydrofolate reductase
J Med Chem 48: 1448-69 (2005)
Article DOI: 10.1021/jm040153n
BindingDB Entry DOI: 10.7270/Q2V40TQ3
Dihydrofolate reductase (DHFR)
(Toxoplasma gondii)
BDBM50049611
(6-[(Methyl-phenyl-amino)-methyl]-pyrido[3,2-d]pyri...)
Show SMILES CN(Cc1ccc2nc(N)nc(N)c2n1)c1ccccc1
Show InChI InChI=1S/C15H16N6/c1-21(11-5-3-2-4-6-11)9-10-7-8-12-13(18-10)14(16)20-15(17)19-12/h2-8H,9H2,1H3,(H4,16,17,19,20)
n/an/a 0.840n/an/an/an/an/an/a
Duquesne University
Curated by ChEMBL
Assay Description
Inhibition of Toxoplasma gondii dihydrofolate reductase
J Med Chem 48: 1448-69 (2005)
Article DOI: 10.1021/jm040153n
BindingDB Entry DOI: 10.7270/Q2V40TQ3
Dihydrofolate reductase
(Saccharomyces cerevisiae)
BDBM50049611
(6-[(Methyl-phenyl-amino)-methyl]-pyrido[3,2-d]pyri...)
Show SMILES CN(Cc1ccc2nc(N)nc(N)c2n1)c1ccccc1
Show InChI InChI=1S/C15H16N6/c1-21(11-5-3-2-4-6-11)9-10-7-8-12-13(18-10)14(16)20-15(17)19-12/h2-8H,9H2,1H3,(H4,16,17,19,20)
Reactome pathway
n/an/a 290n/an/an/an/an/an/a
Duquesne University
Curated by ChEMBL
Assay Description
Inhibitory activity against Pneumocystis carinii dihydrofolate reductase.
J Med Chem 39: 1836-45 (1996)
Article DOI: 10.1021/jm950918e
BindingDB Entry DOI: 10.7270/Q2319TXB