BDBM50049619 3-Chloro-4,4',5'-trifluoro-[1,1';2',1'']terphenyl-4''-sulfonic acid amide::CHEMBL52820
SMILES: NS(=O)(=O)c1ccc(cc1)-c1cc(F)c(F)cc1-c1ccc(F)c(Cl)c1
InChI Key: InChIKey=QZOXMKNWQZCVDE-UHFFFAOYSA-N
Data: 3 IC50
Activity Spreadsheet -- Enzyme Inhibition Constant Data from BindingDB
Found 3 hits for monomerid = 50049619
Trg + Lig
Ki
nM
ΔG°
kcal/mole
IC50
nM
Kd
nM
EC50/IC50
nM
koff
s-1
kon
M-1s-1
pHTemp
°C
Cyclooxygenase-1 (COX-1)
(Homo sapiens (Human))
BDBM50049619
(3-Chloro-4,4',5'-trifluoro-[1,1';2',1'']terphenyl-...)
Show SMILES NS(=O)(=O)c1ccc(cc1)-c1cc(F)c(F)cc1-c1ccc(F)c(Cl)c1
Show InChI InChI=1S/C18H11ClF3NO2S/c19-15-7-11(3-6-16(15)20)14-9-18(22)17(21)8-13(14)10-1-4-12(5-2-10)26(23,24)25/h1-9H,(H2,23,24,25)
n/an/a 5.50E+3n/an/an/an/an/an/a
Searle Research and Development
Curated by ChEMBL
Assay Description
In vitro inhibitory activity against human recombinant prostaglandin G/H synthase 1.
J Med Chem 39: 1846-56 (1996)
Article DOI: 10.1021/jm950878e
BindingDB Entry DOI: 10.7270/Q2Z89BGW
Cyclooxygenase
(Homo sapiens (Human))
BDBM50049619
(3-Chloro-4,4',5'-trifluoro-[1,1';2',1'']terphenyl-...)
Show SMILES NS(=O)(=O)c1ccc(cc1)-c1cc(F)c(F)cc1-c1ccc(F)c(Cl)c1
Show InChI InChI=1S/C18H11ClF3NO2S/c19-15-7-11(3-6-16(15)20)14-9-18(22)17(21)8-13(14)10-1-4-12(5-2-10)26(23,24)25/h1-9H,(H2,23,24,25)
NCI pathway
Reactome pathway
n/an/a 2n/an/an/an/an/an/a
Universit£ de Lille 2
Curated by ChEMBL
Assay Description
Inhibition of human Prostaglandin G/H synthase 2
J Med Chem 44: 3223-30 (2001)
BindingDB Entry DOI: 10.7270/Q2736S4D
Cyclooxygenase
(Homo sapiens (Human))
BDBM50049619
(3-Chloro-4,4',5'-trifluoro-[1,1';2',1'']terphenyl-...)
Show SMILES NS(=O)(=O)c1ccc(cc1)-c1cc(F)c(F)cc1-c1ccc(F)c(Cl)c1
Show InChI InChI=1S/C18H11ClF3NO2S/c19-15-7-11(3-6-16(15)20)14-9-18(22)17(21)8-13(14)10-1-4-12(5-2-10)26(23,24)25/h1-9H,(H2,23,24,25)
NCI pathway
Reactome pathway
n/an/a 2n/an/an/an/an/an/a
Searle Research and Development
Curated by ChEMBL
Assay Description
In vitro inhibitory activity against human recombinant prostaglandin G/H synthase 2
J Med Chem 39: 1846-56 (1996)
Article DOI: 10.1021/jm950878e
BindingDB Entry DOI: 10.7270/Q2Z89BGW