BDBM50049653 4-Chloro-4',5'-difluoro-3-methyl-[1,1';2',1'']terphenyl-4''-sulfonic acid amide::CHEMBL55805
SMILES: Cc1cc(ccc1Cl)-c1cc(F)c(F)cc1-c1ccc(cc1)S(N)(=O)=O
InChI Key: InChIKey=QRQGMZAVXNCVOI-UHFFFAOYSA-N
Data: 3 IC50
Activity Spreadsheet -- Enzyme Inhibition Constant Data from BindingDB
Found 3 hits for monomerid = 50049653
Trg + Lig
Ki
nM
ΔG°
kcal/mole
IC50
nM
Kd
nM
EC50/IC50
nM
koff
s-1
kon
M-1s-1
pHTemp
°C
Cyclooxygenase-1 (COX-1)
(Homo sapiens (Human))
BDBM50049653
(4-Chloro-4',5'-difluoro-3-methyl-[1,1';2',1'']terp...)
Show SMILES Cc1cc(ccc1Cl)-c1cc(F)c(F)cc1-c1ccc(cc1)S(N)(=O)=O
Show InChI InChI=1S/C19H14ClF2NO2S/c1-11-8-13(4-7-17(11)20)16-10-19(22)18(21)9-15(16)12-2-5-14(6-3-12)26(23,24)25/h2-10H,1H3,(H2,23,24,25)
n/an/a 3.90E+3n/an/an/an/an/an/a
Searle Research and Development
Curated by ChEMBL
Assay Description
In vitro inhibitory activity against human recombinant prostaglandin G/H synthase 1.
J Med Chem 39: 1846-56 (1996)
Article DOI: 10.1021/jm950878e
BindingDB Entry DOI: 10.7270/Q2Z89BGW
Cyclooxygenase
(Homo sapiens (Human))
BDBM50049653
(4-Chloro-4',5'-difluoro-3-methyl-[1,1';2',1'']terp...)
Show SMILES Cc1cc(ccc1Cl)-c1cc(F)c(F)cc1-c1ccc(cc1)S(N)(=O)=O
Show InChI InChI=1S/C19H14ClF2NO2S/c1-11-8-13(4-7-17(11)20)16-10-19(22)18(21)9-15(16)12-2-5-14(6-3-12)26(23,24)25/h2-10H,1H3,(H2,23,24,25)
NCI pathway
Reactome pathway
n/an/a 3.02n/an/an/an/an/an/a
Universit£ de Lille 2
Curated by ChEMBL
Assay Description
Inhibition of human Prostaglandin G/H synthase 2
J Med Chem 44: 3223-30 (2001)
BindingDB Entry DOI: 10.7270/Q2736S4D
Cyclooxygenase
(Homo sapiens (Human))
BDBM50049653
(4-Chloro-4',5'-difluoro-3-methyl-[1,1';2',1'']terp...)
Show SMILES Cc1cc(ccc1Cl)-c1cc(F)c(F)cc1-c1ccc(cc1)S(N)(=O)=O
Show InChI InChI=1S/C19H14ClF2NO2S/c1-11-8-13(4-7-17(11)20)16-10-19(22)18(21)9-15(16)12-2-5-14(6-3-12)26(23,24)25/h2-10H,1H3,(H2,23,24,25)
NCI pathway
Reactome pathway
n/an/a 3n/an/an/an/an/an/a
Searle Research and Development
Curated by ChEMBL
Assay Description
In vitro inhibitory activity against human recombinant prostaglandin G/H synthase 2
J Med Chem 39: 1846-56 (1996)
Article DOI: 10.1021/jm950878e
BindingDB Entry DOI: 10.7270/Q2Z89BGW