BDBM50050056 2-[(R)-1-[(S)-2-(3-Cyclohexyl-3-methyl-ureido)-4-methyl-pentanoylamino]-2-(1-methyl-1H-indol-3-yl)-ethyl]-5-methyl-1H-imidazole-4-carboxylic acid::CHEMBL414605
SMILES: CC(C)C[C@H](NC(=O)N(C)C1CCCCC1)C(=O)N[C@H](Cc1cn(C)c2ccccc12)c1nc(C(O)=O)c(C)[nH]1
InChI Key: InChIKey=JUYJVWUMDGZHSF-RPWUZVMVSA-N
Data: 2 IC50
Activity Spreadsheet -- Enzyme Inhibition Constant Data from BindingDB
Found 2 hits for monomerid = 50050056
Trg + Lig
Ki
nM
ΔG°
kcal/mole
IC50
nM
Kd
nM
EC50/IC50
nM
koff
s-1
kon
M-1s-1
pHTemp
°C
EDNRB
(Homo sapiens (Human))
BDBM50050056
(2-[(R)-1-[(S)-2-(3-Cyclohexyl-3-methyl-ureido)-4-m...)
Show SMILES CC(C)C[C@H](NC(=O)N(C)C1CCCCC1)C(=O)N[C@H](Cc1cn(C)c2ccccc12)c1nc(C(O)=O)c(C)[nH]1
Show InChI InChI=1S/C30H42N6O4/c1-18(2)15-24(33-30(40)36(5)21-11-7-6-8-12-21)28(37)32-23(27-31-19(3)26(34-27)29(38)39)16-20-17-35(4)25-14-10-9-13-22(20)25/h9-10,13-14,17-18,21,23-24H,6-8,11-12,15-16H2,1-5H3,(H,31,34)(H,32,37)(H,33,40)(H,38,39)/t23-,24+/m1/s1
n/an/a 2.00E+4n/an/an/an/an/an/a
Abbott Laboratories
Curated by ChEMBL
Assay Description
Inhibitory activity was evaluated against human Endothelin B receptor
J Med Chem 39: 982-91 (1996)
Article DOI: 10.1021/jm9505932
BindingDB Entry DOI: 10.7270/Q2DB80WG
Endothelin-1 receptor
(Homo sapiens (Human))
BDBM50050056
(2-[(R)-1-[(S)-2-(3-Cyclohexyl-3-methyl-ureido)-4-m...)
Show SMILES CC(C)C[C@H](NC(=O)N(C)C1CCCCC1)C(=O)N[C@H](Cc1cn(C)c2ccccc12)c1nc(C(O)=O)c(C)[nH]1
Show InChI InChI=1S/C30H42N6O4/c1-18(2)15-24(33-30(40)36(5)21-11-7-6-8-12-21)28(37)32-23(27-31-19(3)26(34-27)29(38)39)16-20-17-35(4)25-14-10-9-13-22(20)25/h9-10,13-14,17-18,21,23-24H,6-8,11-12,15-16H2,1-5H3,(H,31,34)(H,32,37)(H,33,40)(H,38,39)/t23-,24+/m1/s1
n/an/a 1.80n/an/an/an/an/an/a
Abbott Laboratories
Curated by ChEMBL
Assay Description
Inhibitory activity was evaluated against human Endothelin A receptor
J Med Chem 39: 982-91 (1996)
Article DOI: 10.1021/jm9505932
BindingDB Entry DOI: 10.7270/Q2DB80WG