BDBM50050437 CHEMBL1532914
SMILES: Fc1cccc(c1)C(=O)Nc1cccc(NC(=O)c2ccccc2)c1
InChI Key: InChIKey=JIXAVKHNSWAKPX-UHFFFAOYSA-N
Data: 2 IC50
Activity Spreadsheet -- Enzyme Inhibition Constant Data from BindingDB
Found 2 hits for monomerid = 50050437
Trg + Lig
Ki
nM
ΔG°
kcal/mole
IC50
nM
Kd
nM
EC50/IC50
nM
koff
s-1
kon
M-1s-1
pHTemp
°C
Potassium channel subfamily K member 9
(Homo sapiens (Human))
BDBM50050437
(CHEMBL1532914)
Show SMILES Fc1cccc(c1)C(=O)Nc1cccc(NC(=O)c2ccccc2)c1
Show InChI InChI=1S/C20H15FN2O2/c21-16-9-4-8-15(12-16)20(25)23-18-11-5-10-17(13-18)22-19(24)14-6-2-1-3-7-14/h1-13H,(H,22,24)(H,23,25)
Reactome pathway
n/an/a>3.00E+4n/an/an/an/an/an/a
University of Kansas Specialized Chemistry Center
Curated by ChEMBL
Assay Description
Inhibition of TASK-3 (unknown origin) expressed in CHO cells by thallium flux assay
Bioorg Med Chem Lett 24: 3968-73 (2014)
Article DOI: 10.1016/j.bmcl.2014.06.032
BindingDB Entry DOI: 10.7270/Q2805487
Potassium channel protein TASK-1
(Homo sapiens (Human))
BDBM50050437
(CHEMBL1532914)
Show SMILES Fc1cccc(c1)C(=O)Nc1cccc(NC(=O)c2ccccc2)c1
Show InChI InChI=1S/C20H15FN2O2/c21-16-9-4-8-15(12-16)20(25)23-18-11-5-10-17(13-18)22-19(24)14-6-2-1-3-7-14/h1-13H,(H,22,24)(H,23,25)
n/an/a 45n/an/an/an/an/an/a
University of Kansas Specialized Chemistry Center
Curated by ChEMBL
Assay Description
Inhibition of TASK-1 (unknown origin) expressed in CHO cells by thallium flux assay
Bioorg Med Chem Lett 24: 3968-73 (2014)
Article DOI: 10.1016/j.bmcl.2014.06.032
BindingDB Entry DOI: 10.7270/Q2805487