BDBM50050480 9-Hydroxymethyl-1-methyl-10-methylamino-tricyclo[7.3.1.0*2,7*]trideca-2,4,6-trien-4-ol::CHEMBL57879
SMILES: CNC1CCC2(C)CC1(CO)Cc1ccc(O)cc21
InChI Key: InChIKey=HBHHFUIZPMLGCC-UHFFFAOYSA-N
Data: 4 KI
Activity Spreadsheet -- Enzyme Inhibition Constant Data from BindingDB
Found 4 hits for monomerid = 50050480
Trg + Lig
Ki
nM
ΔG°
kcal/mole
IC50
nM
Kd
nM
EC50/IC50
nM
koff
s-1
kon
M-1s-1
pHTemp
°C
Mu opioid receptor
(CALF)
BDBM50050480
(9-Hydroxymethyl-1-methyl-10-methylamino-tricyclo[7...)
Show SMILES CNC1CCC2(C)CC1(CO)Cc1ccc(O)cc21 |TLB:1:2:7:18.12.11,THB:17:18:7:2.4.3|
Show InChI InChI=1S/C16H23NO2/c1-15-6-5-14(17-2)16(9-15,10-18)8-11-3-4-12(19)7-13(11)15/h3-4,7,14,17-19H,5-6,8-10H2,1-2H3
42n/an/an/an/an/an/an/an/a
Institute
Curated by ChEMBL
Assay Description
Activity of the compound was evaluated by inhibition of the binding of 0.8 nM [3H]- DAMGO at Opioid receptor mu 1 binding site
J Med Chem 39: 1956-66 (1996)
Article DOI: 10.1021/jm950817g
BindingDB Entry DOI: 10.7270/Q2CC0ZR8
Mu opioid receptor
(CALF)
BDBM50050480
(9-Hydroxymethyl-1-methyl-10-methylamino-tricyclo[7...)
Show SMILES CNC1CCC2(C)CC1(CO)Cc1ccc(O)cc21 |TLB:1:2:7:18.12.11,THB:17:18:7:2.4.3|
Show InChI InChI=1S/C16H23NO2/c1-15-6-5-14(17-2)16(9-15,10-18)8-11-3-4-12(19)7-13(11)15/h3-4,7,14,17-19H,5-6,8-10H2,1-2H3
380n/an/an/an/an/an/an/an/a
Institute
Curated by ChEMBL
Assay Description
Activity of the compound was evaluated by inhibition of the binding of 0.8 nM [3H]- DAMGO at Opioid receptor mu 1 binding site
J Med Chem 39: 1956-66 (1996)
Article DOI: 10.1021/jm950817g
BindingDB Entry DOI: 10.7270/Q2CC0ZR8
Kappa-type opioid receptor
(Cavia porcellus (domestic guinea pig))
BDBM50050480
(9-Hydroxymethyl-1-methyl-10-methylamino-tricyclo[7...)
Show SMILES CNC1CCC2(C)CC1(CO)Cc1ccc(O)cc21 |TLB:1:2:7:18.12.11,THB:17:18:7:2.4.3|
Show InChI InChI=1S/C16H23NO2/c1-15-6-5-14(17-2)16(9-15,10-18)8-11-3-4-12(19)7-13(11)15/h3-4,7,14,17-19H,5-6,8-10H2,1-2H3
440n/an/an/an/an/an/an/an/a
Institute
Curated by ChEMBL
Assay Description
Activity of the compound was evaluated by inhibition of the binding of 1 nM [3H]U69,593 at Opioid receptor kappa 1 binding site
J Med Chem 39: 1956-66 (1996)
Article DOI: 10.1021/jm950817g
BindingDB Entry DOI: 10.7270/Q2CC0ZR8
Delta-type opioid receptor
(Homo sapiens (Human))
BDBM50050480
(9-Hydroxymethyl-1-methyl-10-methylamino-tricyclo[7...)
Show SMILES CNC1CCC2(C)CC1(CO)Cc1ccc(O)cc21 |TLB:1:2:7:18.12.11,THB:17:18:7:2.4.3|
Show InChI InChI=1S/C16H23NO2/c1-15-6-5-14(17-2)16(9-15,10-18)8-11-3-4-12(19)7-13(11)15/h3-4,7,14,17-19H,5-6,8-10H2,1-2H3
Reactome pathway
>1.00E+6n/an/an/an/an/an/an/an/a
Institute
Curated by ChEMBL
Assay Description
Activity of the compound was evaluated by inhibition of the binding of 1 nM [3H]-DPDPE at Opioid receptor delta 1 binding site
J Med Chem 39: 1956-66 (1996)
Article DOI: 10.1021/jm950817g
BindingDB Entry DOI: 10.7270/Q2CC0ZR8