BDBM50050536 CHEMBL3188463
SMILES: CN(C)c1ccc(cc1)C(=O)Nc1cccc(NC(=O)c2cccc(C)c2)c1
InChI Key: InChIKey=ZUSOJHCYWNWOHQ-UHFFFAOYSA-N
Data: 2 IC50
Activity Spreadsheet -- Enzyme Inhibition Constant Data from BindingDB
Found 2 hits for monomerid = 50050536
Trg + Lig
Ki
nM
ΔG°
kcal/mole
IC50
nM
Kd
nM
EC50/IC50
nM
koff
s-1
kon
M-1s-1
pHTemp
°C
Potassium channel subfamily K member 9
(Homo sapiens (Human))
BDBM50050536
(CHEMBL3188463)
Show SMILES CN(C)c1ccc(cc1)C(=O)Nc1cccc(NC(=O)c2cccc(C)c2)c1
Show InChI InChI=1S/C23H23N3O2/c1-16-6-4-7-18(14-16)23(28)25-20-9-5-8-19(15-20)24-22(27)17-10-12-21(13-11-17)26(2)3/h4-15H,1-3H3,(H,24,27)(H,25,28)
Reactome pathway
n/an/a>3.00E+4n/an/an/an/an/an/a
University of Kansas Specialized Chemistry Center
Curated by ChEMBL
Assay Description
Inhibition of TASK-3 (unknown origin) expressed in CHO cells by thallium flux assay
Bioorg Med Chem Lett 24: 3968-73 (2014)
Article DOI: 10.1016/j.bmcl.2014.06.032
BindingDB Entry DOI: 10.7270/Q2805487
Potassium channel protein TASK-1
(Homo sapiens (Human))
BDBM50050536
(CHEMBL3188463)
Show SMILES CN(C)c1ccc(cc1)C(=O)Nc1cccc(NC(=O)c2cccc(C)c2)c1
Show InChI InChI=1S/C23H23N3O2/c1-16-6-4-7-18(14-16)23(28)25-20-9-5-8-19(15-20)24-22(27)17-10-12-21(13-11-17)26(2)3/h4-15H,1-3H3,(H,24,27)(H,25,28)
n/an/a 150n/an/an/an/an/an/a
University of Kansas Specialized Chemistry Center
Curated by ChEMBL
Assay Description
Inhibition of TASK-1 (unknown origin) expressed in CHO cells by thallium flux assay
Bioorg Med Chem Lett 24: 3968-73 (2014)
Article DOI: 10.1016/j.bmcl.2014.06.032
BindingDB Entry DOI: 10.7270/Q2805487