BDBM50050548 CHEMBL3317854
SMILES: COc1cc(ccn1)C(=O)Nc1cccc(NC(=O)c2cccc(C)c2)c1
InChI Key: InChIKey=ZOQPJCLETYYEJR-UHFFFAOYSA-N
Data: 2 IC50
Activity Spreadsheet -- Enzyme Inhibition Constant Data from BindingDB
Found 2 hits for monomerid = 50050548
Trg + Lig
Ki
nM
ΔG°
kcal/mole
IC50
nM
Kd
nM
EC50/IC50
nM
koff
s-1
kon
M-1s-1
pHTemp
°C
Potassium channel subfamily K member 9
(Homo sapiens (Human))
BDBM50050548
(CHEMBL3317854)
Show SMILES COc1cc(ccn1)C(=O)Nc1cccc(NC(=O)c2cccc(C)c2)c1
Show InChI InChI=1S/C21H19N3O3/c1-14-5-3-6-15(11-14)20(25)23-17-7-4-8-18(13-17)24-21(26)16-9-10-22-19(12-16)27-2/h3-13H,1-2H3,(H,23,25)(H,24,26)
Reactome pathway
n/an/a 2.43E+3n/an/an/an/an/an/a
University of Kansas Specialized Chemistry Center
Curated by ChEMBL
Assay Description
Inhibition of TASK-3 (unknown origin) expressed in CHO cells by thallium flux assay
Bioorg Med Chem Lett 24: 3968-73 (2014)
Article DOI: 10.1016/j.bmcl.2014.06.032
BindingDB Entry DOI: 10.7270/Q2805487
Potassium channel protein TASK-1
(Homo sapiens (Human))
BDBM50050548
(CHEMBL3317854)
Show SMILES COc1cc(ccn1)C(=O)Nc1cccc(NC(=O)c2cccc(C)c2)c1
Show InChI InChI=1S/C21H19N3O3/c1-14-5-3-6-15(11-14)20(25)23-17-7-4-8-18(13-17)24-21(26)16-9-10-22-19(12-16)27-2/h3-13H,1-2H3,(H,23,25)(H,24,26)
n/an/a 180n/an/an/an/an/an/a
University of Kansas Specialized Chemistry Center
Curated by ChEMBL
Assay Description
Inhibition of TASK-1 (unknown origin) expressed in CHO cells by thallium flux assay
Bioorg Med Chem Lett 24: 3968-73 (2014)
Article DOI: 10.1016/j.bmcl.2014.06.032
BindingDB Entry DOI: 10.7270/Q2805487