BDBM50050624 6-(5-Dimethylamino-2-propoxy-phenyl)-1-ethyl-3-methyl-1,5-dihydro-pyrazolo[3,4-d]pyrimidin-4-one::CHEMBL42776
SMILES: CCCOc1ccc(cc1-c1nc2n(CC)nc(C)c2c(=O)[nH]1)N(C)C
InChI Key: InChIKey=ALYKWZQKEAKZMJ-UHFFFAOYSA-N
Data: 1 IC50  1 EC50
Activity Spreadsheet -- Enzyme Inhibition Constant Data from BindingDB
Found 2 hits for monomerid = 50050624
Trg + Lig
Ki
nM
ΔG°
kcal/mole
IC50
nM
Kd
nM
EC50/IC50
nM
koff
s-1
kon
M-1s-1
pHTemp
°C
Phosphodiesterase 5A
(Rattus norvegicus)
BDBM50050624
(6-(5-Dimethylamino-2-propoxy-phenyl)-1-ethyl-3-met...)
Show SMILES CCCOc1ccc(cc1-c1nc2n(CC)nc(C)c2c(=O)[nH]1)N(C)C
Show InChI InChI=1S/C19H25N5O2/c1-6-10-26-15-9-8-13(23(4)5)11-14(15)17-20-18-16(19(25)21-17)12(3)22-24(18)7-2/h8-9,11H,6-7,10H2,1-5H3,(H,20,21,25)
Reactome pathway
n/an/an/an/a 1.50E+3n/an/an/an/a
Laboratories Glaxo Wellcome Centre de Recherches
Curated by ChEMBL
Assay Description
Compound was tested for inhibition of stimulation of rat aortic smooth muscle cells (RSMC)
J Med Chem 39: 1635-44 (1996)
Article DOI: 10.1021/jm950812j
BindingDB Entry DOI: 10.7270/Q2057F1T
cGMP-specific 3',5'-cyclic phosphodiesterase
(Homo sapiens (Human))
BDBM50050624
(6-(5-Dimethylamino-2-propoxy-phenyl)-1-ethyl-3-met...)
Show SMILES CCCOc1ccc(cc1-c1nc2n(CC)nc(C)c2c(=O)[nH]1)N(C)C
Show InChI InChI=1S/C19H25N5O2/c1-6-10-26-15-9-8-13(23(4)5)11-14(15)17-20-18-16(19(25)21-17)12(3)22-24(18)7-2/h8-9,11H,6-7,10H2,1-5H3,(H,20,21,25)
Reactome pathway
n/an/a 4n/an/an/an/an/an/a
Laboratories Glaxo Wellcome Centre de Recherches
Curated by ChEMBL
Assay Description
Inhibition of Phosphodiesterase 5 from human
J Med Chem 39: 1635-44 (1996)
Article DOI: 10.1021/jm950812j
BindingDB Entry DOI: 10.7270/Q2057F1T