BDBM50050705 CHEMBL3318001
SMILES: C[C@@]1(CCCC[C@@H]1Nc1nc(ncc1F)-c1c[nH]c2ncc(Cl)cc12)C(O)=O
InChI Key: InChIKey=SUOGSZSYPIODEX-LIRRHRJNSA-N
Data: 1 Kd
Activity Spreadsheet -- Enzyme Inhibition Constant Data from BindingDB
Found 1 hit for monomerid = 50050705
Trg + Lig
Ki
nM
ΔG°
kcal/mole
IC50
nM
Kd
nM
EC50/IC50
nM
koff
s-1
kon
M-1s-1
pHTemp
°C
Polymerase basic protein 2
(Influenza A virus (strain A/Puerto Rico/8/1934 H1N...)
BDBM50050705
(CHEMBL3318001)
Show SMILES C[C@@]1(CCCC[C@@H]1Nc1nc(ncc1F)-c1c[nH]c2ncc(Cl)cc12)C(O)=O |r|
Show InChI InChI=1S/C19H19ClFN5O2/c1-19(18(27)28)5-3-2-4-14(19)25-17-13(21)9-24-16(26-17)12-8-23-15-11(12)6-10(20)7-22-15/h6-9,14H,2-5H2,1H3,(H,22,23)(H,27,28)(H,24,25,26)/t14-,19-/m0/s1
n/an/an/a<2n/an/an/an/an/a
Vertex Pharmaceuticals Inc.
Curated by ChEMBL
Assay Description
Binding affinity to influenza A virus (A/Puerto Rico/8/1934(H1N1)) PB2 by competition binding fluorescence polarization (FP) assay
J Med Chem 57: 6668-78 (2014)
Article DOI: 10.1021/jm5007275
BindingDB Entry DOI: 10.7270/Q2R21316