BDBM50050754 CHEMBL3317976
SMILES: OC[C@H](O)CN1CCC[C@@H](C1)Nc1nc(ncc1F)-c1c[nH]c2ncc(Cl)cc12
InChI Key: InChIKey=JROMAUSTEVLKCI-QWHCGFSZSA-N
Data: 1 Kd
Activity Spreadsheet -- Enzyme Inhibition Constant Data from BindingDB
Found 1 hit for monomerid = 50050754
Trg + Lig
Ki
nM
ΔG°
kcal/mole
IC50
nM
Kd
nM
EC50/IC50
nM
koff
s-1
kon
M-1s-1
pHTemp
°C
Polymerase basic protein 2
(Influenza A virus (strain A/Puerto Rico/8/1934 H1N...)
BDBM50050754
(CHEMBL3317976)
Show SMILES OC[C@H](O)CN1CCC[C@@H](C1)Nc1nc(ncc1F)-c1c[nH]c2ncc(Cl)cc12 |r|
Show InChI InChI=1S/C19H22ClFN6O2/c20-11-4-14-15(6-23-17(14)22-5-11)18-24-7-16(21)19(26-18)25-12-2-1-3-27(8-12)9-13(29)10-28/h4-7,12-13,28-29H,1-3,8-10H2,(H,22,23)(H,24,25,26)/t12-,13+/m0/s1
n/an/an/a 400n/an/an/an/an/a
Vertex Pharmaceuticals Inc.
Curated by ChEMBL
Assay Description
Binding affinity to influenza A virus (A/Puerto Rico/8/1934(H1N1)) PB2 by competition binding fluorescence polarization (FP) assay
J Med Chem 57: 6668-78 (2014)
Article DOI: 10.1021/jm5007275
BindingDB Entry DOI: 10.7270/Q2R21316