BDBM50050760 CHEMBL3317981
SMILES: CC(=O)N[C@@H]1CCC[C@@H](C1)Nc1nc(ncc1F)-c1c[nH]c2ncc(Cl)cc12
InChI Key:
Data: 1 Kd
Activity Spreadsheet -- Enzyme Inhibition Constant Data from BindingDB
Found 1 hit for monomerid = 50050760
Trg + Lig
Ki
nM
ΔG°
kcal/mole
IC50
nM
Kd
nM
EC50/IC50
nM
koff
s-1
kon
M-1s-1
pHTemp
°C
Polymerase basic protein 2
(Influenza A virus (strain A/Puerto Rico/8/1934 H1N...)
BDBM50050760
(CHEMBL3317981)
Show SMILES CC(=O)N[C@@H]1CCC[C@@H](C1)Nc1nc(ncc1F)-c1c[nH]c2ncc(Cl)cc12 |r|
n/an/an/a 70n/an/an/an/an/a
Vertex Pharmaceuticals Inc.
Curated by ChEMBL
Assay Description
Binding affinity to influenza A virus (A/Puerto Rico/8/1934(H1N1)) PB2 by competition binding fluorescence polarization (FP) assay
J Med Chem 57: 6668-78 (2014)
Article DOI: 10.1021/jm5007275
BindingDB Entry DOI: 10.7270/Q2R21316