BDBM50050815 4-Chloro-7-cyclopropylmethyl-9-methyl-6,7,8,9-tetrahydro-2H-2,7,9a-triaza-benzo[cd]azulene-1-thione::CHEMBL66704
SMILES: CC1CN(CC2CC2)Cc2cc(Cl)cc3[nH]c(=S)n1c23
InChI Key: InChIKey=IHSAXGWUBJTHME-UHFFFAOYSA-N
Data: 2 IC50
Activity Spreadsheet -- Enzyme Inhibition Constant Data from BindingDB
Found 2 hits for monomerid = 50050815
Trg + Lig
Ki
nM
ΔG°
kcal/mole
IC50
nM
Kd
nM
EC50/IC50
nM
koff
s-1
kon
M-1s-1
pHTemp
°C
Reverse transcriptase
(Human immunodeficiency virus 1)
BDBM50050815
(4-Chloro-7-cyclopropylmethyl-9-methyl-6,7,8,9-tetr...)
Show SMILES CC1CN(CC2CC2)Cc2cc(Cl)cc3[nH]c(=S)n1c23
Show InChI InChI=1S/C15H18ClN3S/c1-9-6-18(7-10-2-3-10)8-11-4-12(16)5-13-14(11)19(9)15(20)17-13/h4-5,9-10H,2-3,6-8H2,1H3,(H,17,20)
n/an/a 2.19E+3n/an/an/an/an/an/a
Jadavpur University
Curated by ChEMBL
Assay Description
Inhibition of HIV1 reverse transcriptase
Eur J Med Chem 44: 1509-24 (2009)
Article DOI: 10.1016/j.ejmech.2008.07.020
BindingDB Entry DOI: 10.7270/Q29889TP
Human immunodeficiency virus type 1 reverse transcriptase
(Human immunodeficiency virus 1)
BDBM50050815
(4-Chloro-7-cyclopropylmethyl-9-methyl-6,7,8,9-tetr...)
Show SMILES CC1CN(CC2CC2)Cc2cc(Cl)cc3[nH]c(=S)n1c23
Show InChI InChI=1S/C15H18ClN3S/c1-9-6-18(7-10-2-3-10)8-11-4-12(16)5-13-14(11)19(9)15(20)17-13/h4-5,9-10H,2-3,6-8H2,1H3,(H,17,20)
n/an/a 2.18E+3n/an/an/an/an/an/a
IBM Thomas J. Watson Research Center
Curated by ChEMBL
Assay Description
Inhibitory concentration against HIV-1 replication by interfering with virus reverse transcriptase
J Med Chem 39: 2129-40 (1996)
Article DOI: 10.1021/jm950589q
BindingDB Entry DOI: 10.7270/Q2697471