BDBM50050822 (S)-2-{(S)-3-Carboxy-2-[(1-{(S)-2-[3-(1-ethyl-propyl)-ureido]-3,3-dimethyl-butyryl}-3-methylcarbamoyl-piperidine-2-carbonyl)-amino]-propionylamino}-4-methyl-pentanoic acid::CHEMBL420185
SMILES: CCC(CC)NC(=O)N[C@H](C(=O)N1CCCC(C1C(=O)N[C@@H](CC(O)=O)C(=O)N[C@@H](CC(C)C)C(O)=O)C(=O)NC)C(C)(C)C
InChI Key: InChIKey=VABJEHDJUJXSOW-WIXDKPBKSA-N
Data: 1 IC50
Activity Spreadsheet -- Enzyme Inhibition Constant Data from BindingDB
Found 1 hit for monomerid = 50050822
Trg + Lig
Ki
nM
ΔG°
kcal/mole
IC50
nM
Kd
nM
EC50/IC50
nM
koff
s-1
kon
M-1s-1
pHTemp
°C
Ribonucleoside-diphosphate reductase large chain
(Human herpesvirus 1 (strain 17) (HHV-1) (Human her...)
BDBM50050822
((S)-2-{(S)-3-Carboxy-2-[(1-{(S)-2-[3-(1-ethyl-prop...)
Show SMILES CCC(CC)NC(=O)N[C@H](C(=O)N1CCCC(C1C(=O)N[C@@H](CC(O)=O)C(=O)N[C@@H](CC(C)C)C(O)=O)C(=O)NC)C(C)(C)C
Show InChI InChI=1S/C30H52N6O9/c1-9-17(10-2)32-29(45)35-23(30(5,6)7)27(42)36-13-11-12-18(24(39)31-8)22(36)26(41)33-19(15-21(37)38)25(40)34-20(28(43)44)14-16(3)4/h16-20,22-23H,9-15H2,1-8H3,(H,31,39)(H,33,41)(H,34,40)(H,37,38)(H,43,44)(H2,32,35,45)/t18?,19-,20-,22?,23+/m0/s1
n/an/a 10n/an/an/an/an/an/a
Bio-Méga/Boehringer Ingelheim Research Inc.
Curated by ChEMBL
Assay Description
Inhibitory activity against Herpes simplex virus (HSV) ribonucleotide reductase (RR)
J Med Chem 39: 2178-87 (1996)
Article DOI: 10.1021/jm950825x
BindingDB Entry DOI: 10.7270/Q2BG2N22