BDBM50050824 (S)-2-[(S)-3-Carboxy-2-((S)-2-{(S)-2-[(1-ethyl-propylcarbamoyl)-methyl]-3,3-dimethyl-butyrylamino}-4-oxo-4-pyrrolidin-1-yl-butyrylamino)-propionylamino]-4-methyl-pentanoic acid::CHEMBL70278
SMILES: CCC(CC)NC(=O)C[C@H](C(=O)N[C@@H](CC(=O)N1CCCC1)C(=O)N[C@@H](CC(O)=O)C(=O)N[C@@H](CC(C)C)C(O)=O)C(C)(C)C
InChI Key: InChIKey=ZJQJXSUKJLLVKD-LDVJMBRRSA-N
Data: 1 IC50
Activity Spreadsheet -- Enzyme Inhibition Constant Data from BindingDB
Found 1 hit for monomerid = 50050824
Trg + Lig
Ki
nM
ΔG°
kcal/mole
IC50
nM
Kd
nM
EC50/IC50
nM
koff
s-1
kon
M-1s-1
pHTemp
°C
Ribonucleoside-diphosphate reductase large chain
(Human herpesvirus 1 (strain 17) (HHV-1) (Human her...)
BDBM50050824
((S)-2-[(S)-3-Carboxy-2-((S)-2-{(S)-2-[(1-ethyl-pro...)
Show SMILES CCC(CC)NC(=O)C[C@H](C(=O)N[C@@H](CC(=O)N1CCCC1)C(=O)N[C@@H](CC(O)=O)C(=O)N[C@@H](CC(C)C)C(O)=O)C(C)(C)C
Show InChI InChI=1S/C31H53N5O9/c1-8-19(9-2)32-24(37)15-20(31(5,6)7)27(41)33-21(16-25(38)36-12-10-11-13-36)28(42)34-22(17-26(39)40)29(43)35-23(30(44)45)14-18(3)4/h18-23H,8-17H2,1-7H3,(H,32,37)(H,33,41)(H,34,42)(H,35,43)(H,39,40)(H,44,45)/t20-,21+,22+,23+/m1/s1
n/an/a 5n/an/an/an/an/an/a
Bio-Méga/Boehringer Ingelheim Research Inc.
Curated by ChEMBL
Assay Description
Inhibitory activity against Herpes simplex virus (HSV) ribonucleotide reductase (RR)
J Med Chem 39: 2178-87 (1996)
Article DOI: 10.1021/jm950825x
BindingDB Entry DOI: 10.7270/Q2BG2N22