BDBM50050926 (S)-2-((R)-4-Methyl-2-{(S)-2-[(R)-4-methyl-2-((S)-3-phenyl-2-ureido-propionylamino)-pentanoylamino]-3-phenyl-propionylamino}-pentanoylamino)-3-phenyl-propionic acid::CHEMBL6450
SMILES: CC(C)C[C@@H](NC(=O)[C@H](Cc1ccccc1)NC(=O)[C@@H](CC(C)C)NC(=O)[C@H](Cc1ccccc1)NC(N)=O)C(=O)N[C@@H](Cc1ccccc1)C(O)=O
InChI Key: InChIKey=ZCHFBJUWBIBKHD-ZOHVZMGWSA-N
Data: 2 IC50
Activity Spreadsheet -- Enzyme Inhibition Constant Data from BindingDB
Found 2 hits for monomerid = 50050926
Trg + Lig
Ki
nM
ΔG°
kcal/mole
IC50
nM
Kd
nM
EC50/IC50
nM
koff
s-1
kon
M-1s-1
pHTemp
°C
fMet-Leu-Phe receptor
(Homo sapiens (Human))
BDBM50050926
((S)-2-((R)-4-Methyl-2-{(S)-2-[(R)-4-methyl-2-((S)-...)
Show SMILES CC(C)C[C@@H](NC(=O)[C@H](Cc1ccccc1)NC(=O)[C@@H](CC(C)C)NC(=O)[C@H](Cc1ccccc1)NC(N)=O)C(=O)N[C@@H](Cc1ccccc1)C(O)=O
Show InChI InChI=1S/C40H52N6O7/c1-25(2)20-30(43-38(50)33(46-40(41)53)23-28-16-10-6-11-17-28)35(47)44-32(22-27-14-8-5-9-15-27)37(49)42-31(21-26(3)4)36(48)45-34(39(51)52)24-29-18-12-7-13-19-29/h5-19,25-26,30-34H,20-24H2,1-4H3,(H,42,49)(H,43,50)(H,44,47)(H,45,48)(H,51,52)(H3,41,46,53)/t30-,31-,32+,33+,34+/m1/s1
Reactome pathway
n/an/a 800n/an/an/an/an/an/a
Johnson Matthey Biomedical Research
Curated by ChEMBL
Assay Description
Binding affinity towards fMLF receptor using human neutrophils
J Med Chem 39: 1013-5 (1996)
Article DOI: 10.1021/jm950908d
BindingDB Entry DOI: 10.7270/Q2TD9WF6
fMet-Leu-Phe receptor
(Homo sapiens (Human))
BDBM50050926
((S)-2-((R)-4-Methyl-2-{(S)-2-[(R)-4-methyl-2-((S)-...)
Show SMILES CC(C)C[C@@H](NC(=O)[C@H](Cc1ccccc1)NC(=O)[C@@H](CC(C)C)NC(=O)[C@H](Cc1ccccc1)NC(N)=O)C(=O)N[C@@H](Cc1ccccc1)C(O)=O
Show InChI InChI=1S/C40H52N6O7/c1-25(2)20-30(43-38(50)33(46-40(41)53)23-28-16-10-6-11-17-28)35(47)44-32(22-27-14-8-5-9-15-27)37(49)42-31(21-26(3)4)36(48)45-34(39(51)52)24-29-18-12-7-13-19-29/h5-19,25-26,30-34H,20-24H2,1-4H3,(H,42,49)(H,43,50)(H,44,47)(H,45,48)(H,51,52)(H3,41,46,53)/t30-,31-,32+,33+,34+/m1/s1
Reactome pathway
n/an/a 100n/an/an/an/an/an/a
Johnson Matthey Biomedical Research
Curated by ChEMBL
Assay Description
Antagonistic activity was determined by measuring the ability to inhibit superoxide production(stimulated by fMLF) using human neutrophils
J Med Chem 39: 1013-5 (1996)
Article DOI: 10.1021/jm950908d
BindingDB Entry DOI: 10.7270/Q2TD9WF6