BDBM50050941 (S)-2-[(S)-4-Methyl-2-((S)-4-methylsulfanyl-2-ureido-butyrylamino)-pentanoylamino]-3-phenyl-propionic acid::CHEMBL7306
SMILES: CSCC[C@H](NC(N)=O)C(=O)N[C@@H](CC(C)C)C(=O)N[C@@H](Cc1ccccc1)C(O)=O
InChI Key: InChIKey=QZWJPTFPFHOGGG-ULQDDVLXSA-N
Data: 1 IC50  1 EC50
Activity Spreadsheet -- Enzyme Inhibition Constant Data from BindingDB
Found 2 hits for monomerid = 50050941
Trg + Lig
Ki
nM
ΔG°
kcal/mole
IC50
nM
Kd
nM
EC50/IC50
nM
koff
s-1
kon
M-1s-1
pHTemp
°C
fMet-Leu-Phe receptor
(Homo sapiens (Human))
BDBM50050941
((S)-2-[(S)-4-Methyl-2-((S)-4-methylsulfanyl-2-urei...)
Show SMILES CSCC[C@H](NC(N)=O)C(=O)N[C@@H](CC(C)C)C(=O)N[C@@H](Cc1ccccc1)C(O)=O
Show InChI InChI=1S/C21H32N4O5S/c1-13(2)11-16(23-18(26)15(9-10-31-3)25-21(22)30)19(27)24-17(20(28)29)12-14-7-5-4-6-8-14/h4-8,13,15-17H,9-12H2,1-3H3,(H,23,26)(H,24,27)(H,28,29)(H3,22,25,30)/t15-,16-,17-/m0/s1
Reactome pathway
n/an/a 2.00E+3n/an/an/an/an/an/a
Johnson Matthey Biomedical Research
Curated by ChEMBL
Assay Description
Binding affinity towards fMLF receptor using human neutrophils
J Med Chem 39: 1013-5 (1996)
Article DOI: 10.1021/jm950908d
BindingDB Entry DOI: 10.7270/Q2TD9WF6
fMet-Leu-Phe receptor
(Homo sapiens (Human))
BDBM50050941
((S)-2-[(S)-4-Methyl-2-((S)-4-methylsulfanyl-2-urei...)
Show SMILES CSCC[C@H](NC(N)=O)C(=O)N[C@@H](CC(C)C)C(=O)N[C@@H](Cc1ccccc1)C(O)=O
Show InChI InChI=1S/C21H32N4O5S/c1-13(2)11-16(23-18(26)15(9-10-31-3)25-21(22)30)19(27)24-17(20(28)29)12-14-7-5-4-6-8-14/h4-8,13,15-17H,9-12H2,1-3H3,(H,23,26)(H,24,27)(H,28,29)(H3,22,25,30)/t15-,16-,17-/m0/s1
Reactome pathway
n/an/an/an/a 3.00E+3n/an/an/an/a
Johnson Matthey Biomedical Research
Curated by ChEMBL
Assay Description
Agonistic activity was determined by measuring the ability to induce superoxide production(as measured by reduction of cytochrome C) using human neut...
J Med Chem 39: 1013-5 (1996)
Article DOI: 10.1021/jm950908d
BindingDB Entry DOI: 10.7270/Q2TD9WF6