BDBM50050943 (S)-2-[(R)-2-((S)-2-{(R)-2-[(S)-2-(3-Isopropyl-ureido)-3-phenyl-propionylamino]-4-methyl-pentanoylamino}-3-phenyl-propionylamino)-4-methyl-pentanoylamino]-3-phenyl-propionic acid::CHEMBL7122
SMILES: CC(C)C[C@@H](NC(=O)[C@H](Cc1ccccc1)NC(=O)[C@@H](CC(C)C)NC(=O)[C@H](Cc1ccccc1)NC(=O)NC(C)C)C(=O)N[C@@H](Cc1ccccc1)C(O)=O
InChI Key: InChIKey=YJFBNJDVXGRJHI-DWCHZDDLSA-N
Data: 2 IC50
Activity Spreadsheet -- Enzyme Inhibition Constant Data from BindingDB
Found 2 hits for monomerid = 50050943
Trg + Lig
Ki
nM
ΔG°
kcal/mole
IC50
nM
Kd
nM
EC50/IC50
nM
koff
s-1
kon
M-1s-1
pHTemp
°C
fMet-Leu-Phe receptor
(Homo sapiens (Human))
BDBM50050943
((S)-2-[(R)-2-((S)-2-{(R)-2-[(S)-2-(3-Isopropyl-ure...)
Show SMILES CC(C)C[C@@H](NC(=O)[C@H](Cc1ccccc1)NC(=O)[C@@H](CC(C)C)NC(=O)[C@H](Cc1ccccc1)NC(=O)NC(C)C)C(=O)N[C@@H](Cc1ccccc1)C(O)=O
Show InChI InChI=1S/C43H58N6O7/c1-27(2)22-33(46-41(53)36(49-43(56)44-29(5)6)25-31-18-12-8-13-19-31)38(50)47-35(24-30-16-10-7-11-17-30)40(52)45-34(23-28(3)4)39(51)48-37(42(54)55)26-32-20-14-9-15-21-32/h7-21,27-29,33-37H,22-26H2,1-6H3,(H,45,52)(H,46,53)(H,47,50)(H,48,51)(H,54,55)(H2,44,49,56)/t33-,34-,35+,36+,37+/m1/s1
Reactome pathway
n/an/a 200n/an/an/an/an/an/a
Johnson Matthey Biomedical Research
Curated by ChEMBL
Assay Description
Binding affinity towards fMLF receptor using human neutrophils
J Med Chem 39: 1013-5 (1996)
Article DOI: 10.1021/jm950908d
BindingDB Entry DOI: 10.7270/Q2TD9WF6
fMet-Leu-Phe receptor
(Homo sapiens (Human))
BDBM50050943
((S)-2-[(R)-2-((S)-2-{(R)-2-[(S)-2-(3-Isopropyl-ure...)
Show SMILES CC(C)C[C@@H](NC(=O)[C@H](Cc1ccccc1)NC(=O)[C@@H](CC(C)C)NC(=O)[C@H](Cc1ccccc1)NC(=O)NC(C)C)C(=O)N[C@@H](Cc1ccccc1)C(O)=O
Show InChI InChI=1S/C43H58N6O7/c1-27(2)22-33(46-41(53)36(49-43(56)44-29(5)6)25-31-18-12-8-13-19-31)38(50)47-35(24-30-16-10-7-11-17-30)40(52)45-34(23-28(3)4)39(51)48-37(42(54)55)26-32-20-14-9-15-21-32/h7-21,27-29,33-37H,22-26H2,1-6H3,(H,45,52)(H,46,53)(H,47,50)(H,48,51)(H,54,55)(H2,44,49,56)/t33-,34-,35+,36+,37+/m1/s1
Reactome pathway
n/an/a 500n/an/an/an/an/an/a
Johnson Matthey Biomedical Research
Curated by ChEMBL
Assay Description
Antagonistic activity was determined by measuring the ability to inhibit superoxide production(stimulated by fMLF) using human neutrophils
J Med Chem 39: 1013-5 (1996)
Article DOI: 10.1021/jm950908d
BindingDB Entry DOI: 10.7270/Q2TD9WF6