BDBM50050979 (2S,3S,4R)-4-Benzo[1,3]dioxol-5-yl-2-(4-methoxy-phenyl)-1-propylcarbamoylmethyl-pyrrolidine-3-carboxylic acid::CHEMBL9141
SMILES: CCCNC(=O)CN1C[C@H]([C@@H]([C@H]1c1ccc(OC)cc1)C(O)=O)c1ccc2OCOc2c1
InChI Key: InChIKey=AIVZWVQMNJFOIL-OFAXGOBFSA-N
Data: 5 IC50
Activity Spreadsheet -- Enzyme Inhibition Constant Data from BindingDB
Found 5 hits for monomerid = 50050979
Trg + Lig
Ki
nM
ΔG°
kcal/mole
IC50
nM
Kd
nM
EC50/IC50
nM
koff
s-1
kon
M-1s-1
pHTemp
°C
EDNRA
(RAT)
BDBM50050979
((2S,3S,4R)-4-Benzo[1,3]dioxol-5-yl-2-(4-methoxy-ph...)
Show SMILES CCCNC(=O)CN1C[C@H]([C@@H]([C@H]1c1ccc(OC)cc1)C(O)=O)c1ccc2OCOc2c1
Show InChI InChI=1S/C24H28N2O6/c1-3-10-25-21(27)13-26-12-18(16-6-9-19-20(11-16)32-14-31-19)22(24(28)29)23(26)15-4-7-17(30-2)8-5-15/h4-9,11,18,22-23H,3,10,12-14H2,1-2H3,(H,25,27)(H,28,29)/t18-,22-,23+/m0/s1
Reactome pathway
n/an/a 17.2n/an/an/an/an/an/a
Abbott Laboratories
Curated by ChEMBL
Assay Description
Inhibitory activity against the Endothelin A receptor of rat MMQ cells
J Med Chem 39: 1039-48 (1996)
Article DOI: 10.1021/jm9505369
BindingDB Entry DOI: 10.7270/Q29G5KWT
Endothelin receptor ET-B
(Sus scrofa)
BDBM50050979
((2S,3S,4R)-4-Benzo[1,3]dioxol-5-yl-2-(4-methoxy-ph...)
Show SMILES CCCNC(=O)CN1C[C@H]([C@@H]([C@H]1c1ccc(OC)cc1)C(O)=O)c1ccc2OCOc2c1
Show InChI InChI=1S/C24H28N2O6/c1-3-10-25-21(27)13-26-12-18(16-6-9-19-20(11-16)32-14-31-19)22(24(28)29)23(26)15-4-7-17(30-2)8-5-15/h4-9,11,18,22-23H,3,10,12-14H2,1-2H3,(H,25,27)(H,28,29)/t18-,22-,23+/m0/s1
Reactome pathway
n/an/a 398n/an/an/an/an/an/a
Abbott Laboratories
Curated by ChEMBL
Assay Description
Inhibitory activity measured against Endothelin B receptor binding to porcine cerebellum
J Med Chem 39: 1039-48 (1996)
Article DOI: 10.1021/jm9505369
BindingDB Entry DOI: 10.7270/Q29G5KWT
EDNRA
(RAT)
BDBM50050979
((2S,3S,4R)-4-Benzo[1,3]dioxol-5-yl-2-(4-methoxy-ph...)
Show SMILES CCCNC(=O)CN1C[C@H]([C@@H]([C@H]1c1ccc(OC)cc1)C(O)=O)c1ccc2OCOc2c1
Show InChI InChI=1S/C24H28N2O6/c1-3-10-25-21(27)13-26-12-18(16-6-9-19-20(11-16)32-14-31-19)22(24(28)29)23(26)15-4-7-17(30-2)8-5-15/h4-9,11,18,22-23H,3,10,12-14H2,1-2H3,(H,25,27)(H,28,29)/t18-,22-,23+/m0/s1
Reactome pathway
n/an/a 45n/an/an/an/an/an/a
University of Innsbruck
Curated by ChEMBL
Assay Description
Ability to displace [125I]-ET-1 from the rat endothelin A receptor expressed in rat aorta smooth muscle cells.
J Med Chem 47: 2750-60 (2004)
Article DOI: 10.1021/jm031041j
BindingDB Entry DOI: 10.7270/Q26T0M3J
EDNRB
(Homo sapiens (Human))
BDBM50050979
((2S,3S,4R)-4-Benzo[1,3]dioxol-5-yl-2-(4-methoxy-ph...)
Show SMILES CCCNC(=O)CN1C[C@H]([C@@H]([C@H]1c1ccc(OC)cc1)C(O)=O)c1ccc2OCOc2c1
Show InChI InChI=1S/C24H28N2O6/c1-3-10-25-21(27)13-26-12-18(16-6-9-19-20(11-16)32-14-31-19)22(24(28)29)23(26)15-4-7-17(30-2)8-5-15/h4-9,11,18,22-23H,3,10,12-14H2,1-2H3,(H,25,27)(H,28,29)/t18-,22-,23+/m0/s1
n/an/a 579n/an/an/an/an/an/a
Abbott Laboratories
Curated by ChEMBL
Assay Description
Radioligand binding selectivity of the compound to human Endothelin B receptor in chinese hamster ovary cells
J Med Chem 39: 1039-48 (1996)
Article DOI: 10.1021/jm9505369
BindingDB Entry DOI: 10.7270/Q29G5KWT
Endothelin-1 receptor
(Homo sapiens (Human))
BDBM50050979
((2S,3S,4R)-4-Benzo[1,3]dioxol-5-yl-2-(4-methoxy-ph...)
Show SMILES CCCNC(=O)CN1C[C@H]([C@@H]([C@H]1c1ccc(OC)cc1)C(O)=O)c1ccc2OCOc2c1
Show InChI InChI=1S/C24H28N2O6/c1-3-10-25-21(27)13-26-12-18(16-6-9-19-20(11-16)32-14-31-19)22(24(28)29)23(26)15-4-7-17(30-2)8-5-15/h4-9,11,18,22-23H,3,10,12-14H2,1-2H3,(H,25,27)(H,28,29)/t18-,22-,23+/m0/s1
n/an/a 45.3n/an/an/an/an/an/a
Abbott Laboratories
Curated by ChEMBL
Assay Description
Radioligand binding selectivity of the compound to human Endothelin A receptor in chinese hamster ovary cells
J Med Chem 39: 1039-48 (1996)
Article DOI: 10.1021/jm9505369
BindingDB Entry DOI: 10.7270/Q29G5KWT