BDBM50050985 (2S,3S,4R)-4-Benzo[1,3]dioxol-5-yl-2-(4-methoxy-phenyl)-1-[(methyl-pentyl-carbamoyl)-methyl]-pyrrolidine-3-carboxylic acid::CHEMBL9050
SMILES: CCCCCN(C)C(=O)CN1C[C@H]([C@@H]([C@H]1c1ccc(OC)cc1)C(O)=O)c1ccc2OCOc2c1
InChI Key: InChIKey=FPISJZHXLWMBIL-OUIFVKKZSA-N
Data: 2 IC50
Activity Spreadsheet -- Enzyme Inhibition Constant Data from BindingDB
Found 2 hits for monomerid = 50050985
Trg + Lig
Ki
nM
ΔG°
kcal/mole
IC50
nM
Kd
nM
EC50/IC50
nM
koff
s-1
kon
M-1s-1
pHTemp
°C
EDNRA
(RAT)
BDBM50050985
((2S,3S,4R)-4-Benzo[1,3]dioxol-5-yl-2-(4-methoxy-ph...)
Show SMILES CCCCCN(C)C(=O)CN1C[C@H]([C@@H]([C@H]1c1ccc(OC)cc1)C(O)=O)c1ccc2OCOc2c1
Show InChI InChI=1S/C27H34N2O6/c1-4-5-6-13-28(2)24(30)16-29-15-21(19-9-12-22-23(14-19)35-17-34-22)25(27(31)32)26(29)18-7-10-20(33-3)11-8-18/h7-12,14,21,25-26H,4-6,13,15-17H2,1-3H3,(H,31,32)/t21-,25-,26+/m0/s1
Reactome pathway
n/an/a 5.78n/an/an/an/an/an/a
Abbott Laboratories
Curated by ChEMBL
Assay Description
Inhibitory activity against the Endothelin A receptor of rat MMQ cells
J Med Chem 39: 1039-48 (1996)
Article DOI: 10.1021/jm9505369
BindingDB Entry DOI: 10.7270/Q29G5KWT
Endothelin receptor ET-B
(Sus scrofa)
BDBM50050985
((2S,3S,4R)-4-Benzo[1,3]dioxol-5-yl-2-(4-methoxy-ph...)
Show SMILES CCCCCN(C)C(=O)CN1C[C@H]([C@@H]([C@H]1c1ccc(OC)cc1)C(O)=O)c1ccc2OCOc2c1
Show InChI InChI=1S/C27H34N2O6/c1-4-5-6-13-28(2)24(30)16-29-15-21(19-9-12-22-23(14-19)35-17-34-22)25(27(31)32)26(29)18-7-10-20(33-3)11-8-18/h7-12,14,21,25-26H,4-6,13,15-17H2,1-3H3,(H,31,32)/t21-,25-,26+/m0/s1
Reactome pathway
n/an/a 624n/an/an/an/an/an/a
Abbott Laboratories
Curated by ChEMBL
Assay Description
Inhibitory activity measured against Endothelin B receptor binding to porcine cerebellum
J Med Chem 39: 1039-48 (1996)
Article DOI: 10.1021/jm9505369
BindingDB Entry DOI: 10.7270/Q29G5KWT