BDBM50051126 CHEMBL3318294
SMILES: COc1cc2nc(nc(NCCCCCN3CCN(C)CC3)c2cc1OC)N1CCCC1
InChI Key: InChIKey=CAEBMUWEPRDAKS-UHFFFAOYSA-N
Data: 1 IC50
Activity Spreadsheet -- Enzyme Inhibition Constant Data from BindingDB
Found 1 hit for monomerid = 50051126
Trg + Lig
Ki
nM
ΔG°
kcal/mole
IC50
nM
Kd
nM
EC50/IC50
nM
koff
s-1
kon
M-1s-1
pHTemp
°C
SET domain-containing protein 8 (SetD8)
(Homo sapiens (Human))
BDBM50051126
(CHEMBL3318294)
Show SMILES COc1cc2nc(nc(NCCCCCN3CCN(C)CC3)c2cc1OC)N1CCCC1
Show InChI InChI=1S/C24H38N6O2/c1-28-13-15-29(16-14-28)10-6-4-5-9-25-23-19-17-21(31-2)22(32-3)18-20(19)26-24(27-23)30-11-7-8-12-30/h17-18H,4-16H2,1-3H3,(H,25,26,27)
n/an/a 2.90E+4n/an/an/an/an/an/a
University of North Carolina at Chapel Hill
Curated by ChEMBL
Assay Description
Inhibition of SETD8 (unknown origin) catalytic domain expressed in Escherichia coli using biotinylated H4 (1-24) peptide substrate after 1 hr by scin...
J Med Chem 57: 6822-33 (2014)
Article DOI: 10.1021/jm500871s
BindingDB Entry DOI: 10.7270/Q2J9681Q