BDBM50051133 CHEMBL3318301
SMILES: COc1cc2nc(nc(NCCCCCN3CCCC3)c2cc1OC)N(C)C
InChI Key: InChIKey=JKAMVHUUSBPBLZ-UHFFFAOYSA-N
Data: 1 IC50
Activity Spreadsheet -- Enzyme Inhibition Constant Data from BindingDB
Found 1 hit for monomerid = 50051133
Trg + Lig
Ki
nM
ΔG°
kcal/mole
IC50
nM
Kd
nM
EC50/IC50
nM
koff
s-1
kon
M-1s-1
pHTemp
°C
N-lysine methyltransferase KMT5A
(Homo sapiens (Human))
BDBM50051133
(CHEMBL3318301)
Show SMILES COc1cc2nc(nc(NCCCCCN3CCCC3)c2cc1OC)N(C)C
Show InChI InChI=1S/C21H33N5O2/c1-25(2)21-23-17-15-19(28-4)18(27-3)14-16(17)20(24-21)22-10-6-5-7-11-26-12-8-9-13-26/h14-15H,5-13H2,1-4H3,(H,22,23,24)
n/an/a 9.20E+3n/an/an/an/an/an/a
University of North Carolina at Chapel Hill
Curated by ChEMBL
Assay Description
Inhibition of SETD8 (unknown origin) catalytic domain expressed in Escherichia coli using biotinylated H4 (1-24) peptide substrate after 1 hr by scin...
J Med Chem 57: 6822-33 (2014)
Article DOI: 10.1021/jm500871s
BindingDB Entry DOI: 10.7270/Q2J9681Q