BDBM50051394 2-[(R)-2-{2-Cyclopropyl-2-[((2R,6S)-2,6-dimethyl-piperidine-1-carbonyl)-amino]-acetylamino}-3-(2-methyl-1H-indol-3-yl)-propionylamino]-4-methylsulfanyl-butyric acid::CHEMBL307936
SMILES: CSCCC(NC(=O)[C@@H](Cc1c(C)[nH]c2ccccc12)NC(=O)C(NC(=O)N1[C@@H](C)CCC[C@H]1C)C1CC1)C(O)=O
InChI Key: InChIKey=XUXCOWLSMHJSSY-OTQGITMZSA-N
Data: 4 IC50
Activity Spreadsheet -- Enzyme Inhibition Constant Data from BindingDB
Found 4 hits for monomerid = 50051394
Trg + Lig
Ki
nM
ΔG°
kcal/mole
IC50
nM
Kd
nM
EC50/IC50
nM
koff
s-1
kon
M-1s-1
pHTemp
°C
Endothelin-1 receptor
(Homo sapiens (Human))
BDBM50051394
(2-[(R)-2-{2-Cyclopropyl-2-[((2R,6S)-2,6-dimethyl-p...)
Show SMILES CSCCC(NC(=O)[C@@H](Cc1c(C)[nH]c2ccccc12)NC(=O)C(NC(=O)N1[C@@H](C)CCC[C@H]1C)C1CC1)C(O)=O
Show InChI InChI=1S/C30H43N5O5S/c1-17-8-7-9-18(2)35(17)30(40)34-26(20-12-13-20)28(37)33-25(27(36)32-24(29(38)39)14-15-41-4)16-22-19(3)31-23-11-6-5-10-21(22)23/h5-6,10-11,17-18,20,24-26,31H,7-9,12-16H2,1-4H3,(H,32,36)(H,33,37)(H,34,40)(H,38,39)/t17-,18+,24?,25-,26?/m1/s1
n/an/a 3n/an/an/an/an/an/a
Tsukuba Research Institute
Curated by ChEMBL
Assay Description
Binding affinity towards Endothelin A receptor in human neuroblastoma-derived cell line SK-N-MC membranes
J Med Chem 39: 2313-30 (1996)
Article DOI: 10.1021/jm9600914
BindingDB Entry DOI: 10.7270/Q2XS5W2G
Endothelin receptor ET-A
(Sus scrofa)
BDBM50051394
(2-[(R)-2-{2-Cyclopropyl-2-[((2R,6S)-2,6-dimethyl-p...)
Show SMILES CSCCC(NC(=O)[C@@H](Cc1c(C)[nH]c2ccccc12)NC(=O)C(NC(=O)N1[C@@H](C)CCC[C@H]1C)C1CC1)C(O)=O
Show InChI InChI=1S/C30H43N5O5S/c1-17-8-7-9-18(2)35(17)30(40)34-26(20-12-13-20)28(37)33-25(27(36)32-24(29(38)39)14-15-41-4)16-22-19(3)31-23-11-6-5-10-21(22)23/h5-6,10-11,17-18,20,24-26,31H,7-9,12-16H2,1-4H3,(H,32,36)(H,33,37)(H,34,40)(H,38,39)/t17-,18+,24?,25-,26?/m1/s1
Reactome pathway
n/an/a 1n/an/an/an/an/an/a
Tsukuba Research Institute
Curated by ChEMBL
Assay Description
Binding affinity towards endothelin A receptor in porcine aortic smooth muscle membranes.
J Med Chem 39: 2313-30 (1996)
Article DOI: 10.1021/jm9600914
BindingDB Entry DOI: 10.7270/Q2XS5W2G
Endothelin receptor ET-B
(Sus scrofa)
BDBM50051394
(2-[(R)-2-{2-Cyclopropyl-2-[((2R,6S)-2,6-dimethyl-p...)
Show SMILES CSCCC(NC(=O)[C@@H](Cc1c(C)[nH]c2ccccc12)NC(=O)C(NC(=O)N1[C@@H](C)CCC[C@H]1C)C1CC1)C(O)=O
Show InChI InChI=1S/C30H43N5O5S/c1-17-8-7-9-18(2)35(17)30(40)34-26(20-12-13-20)28(37)33-25(27(36)32-24(29(38)39)14-15-41-4)16-22-19(3)31-23-11-6-5-10-21(22)23/h5-6,10-11,17-18,20,24-26,31H,7-9,12-16H2,1-4H3,(H,32,36)(H,33,37)(H,34,40)(H,38,39)/t17-,18+,24?,25-,26?/m1/s1
Reactome pathway
n/an/a 2.90n/an/an/an/an/an/a
Tsukuba Research Institute
Curated by ChEMBL
Assay Description
Binding affinity towards endothelin B receptor in porcine cerebellum membranes
J Med Chem 39: 2313-30 (1996)
Article DOI: 10.1021/jm9600914
BindingDB Entry DOI: 10.7270/Q2XS5W2G
EDNRB
(Homo sapiens (Human))
BDBM50051394
(2-[(R)-2-{2-Cyclopropyl-2-[((2R,6S)-2,6-dimethyl-p...)
Show SMILES CSCCC(NC(=O)[C@@H](Cc1c(C)[nH]c2ccccc12)NC(=O)C(NC(=O)N1[C@@H](C)CCC[C@H]1C)C1CC1)C(O)=O
Show InChI InChI=1S/C30H43N5O5S/c1-17-8-7-9-18(2)35(17)30(40)34-26(20-12-13-20)28(37)33-25(27(36)32-24(29(38)39)14-15-41-4)16-22-19(3)31-23-11-6-5-10-21(22)23/h5-6,10-11,17-18,20,24-26,31H,7-9,12-16H2,1-4H3,(H,32,36)(H,33,37)(H,34,40)(H,38,39)/t17-,18+,24?,25-,26?/m1/s1
n/an/a 4n/an/an/an/an/an/a
Tsukuba Research Institute
Curated by ChEMBL
Assay Description
Binding affinity towards Endothelin B receptor in human girardi heart cell membranes
J Med Chem 39: 2313-30 (1996)
Article DOI: 10.1021/jm9600914
BindingDB Entry DOI: 10.7270/Q2XS5W2G