BDBM50051610 CHEMBL3311300
SMILES: CC(C)C[C@@H](NC(=O)[C@H](CC1=CCCCC1)NC(=O)[C@@H](CC(C)C)NC(=O)[C@H](Cc1ccc(cc1)C(=O)c1ccccc1)NC(=O)OC(C)(C)C)C(=O)N[C@@H](Cc1ccccc1)C(O)=O
InChI Key: InChIKey=AWJAGPZHVYVFHV-FYYRRIAOSA-N
Data: 1 IC50  1 Kd
Activity Spreadsheet -- Enzyme Inhibition Constant Data from BindingDB
Found 2 hits for monomerid = 50051610
Trg + Lig
Ki
nM
ΔG°
kcal/mole
IC50
nM
Kd
nM
EC50/IC50
nM
koff
s-1
kon
M-1s-1
pHTemp
°C
fMet-Leu-Phe receptor
(Homo sapiens (Human))
BDBM50051610
(CHEMBL3311300)
Show SMILES CC(C)C[C@@H](NC(=O)[C@H](CC1=CCCCC1)NC(=O)[C@@H](CC(C)C)NC(=O)[C@H](Cc1ccc(cc1)C(=O)c1ccccc1)NC(=O)OC(C)(C)C)C(=O)N[C@@H](Cc1ccccc1)C(O)=O |r,t:10|
Show InChI InChI=1S/C51H67N5O9/c1-32(2)27-39(53-48(61)42(56-50(64)65-51(5,6)7)30-36-23-25-38(26-24-36)44(57)37-21-15-10-16-22-37)45(58)54-41(29-34-17-11-8-12-18-34)47(60)52-40(28-33(3)4)46(59)55-43(49(62)63)31-35-19-13-9-14-20-35/h9-10,13-17,19-26,32-33,39-43H,8,11-12,18,27-31H2,1-7H3,(H,52,60)(H,53,61)(H,54,58)(H,55,59)(H,56,64)(H,62,63)/t39-,40-,41+,42+,43+/m1/s1
Reactome pathway
n/an/a 140n/an/an/an/an/an/a
Saga University
Curated by ChEMBL
Assay Description
Antagonist activity at formyl peptide receptor in human HL60 cells assessed as inhibition of fMLP-induced calcium mobilization incubated for 5 mins p...
Bioorg Med Chem 22: 3824-8 (2014)
Article DOI: 10.1016/j.bmc.2014.06.048
BindingDB Entry DOI: 10.7270/Q28S4RK8
fMet-Leu-Phe receptor
(Homo sapiens (Human))
BDBM50051610
(CHEMBL3311300)
Show SMILES CC(C)C[C@@H](NC(=O)[C@H](CC1=CCCCC1)NC(=O)[C@@H](CC(C)C)NC(=O)[C@H](Cc1ccc(cc1)C(=O)c1ccccc1)NC(=O)OC(C)(C)C)C(=O)N[C@@H](Cc1ccccc1)C(O)=O |r,t:10|
Show InChI InChI=1S/C51H67N5O9/c1-32(2)27-39(53-48(61)42(56-50(64)65-51(5,6)7)30-36-23-25-38(26-24-36)44(57)37-21-15-10-16-22-37)45(58)54-41(29-34-17-11-8-12-18-34)47(60)52-40(28-33(3)4)46(59)55-43(49(62)63)31-35-19-13-9-14-20-35/h9-10,13-17,19-26,32-33,39-43H,8,11-12,18,27-31H2,1-7H3,(H,52,60)(H,53,61)(H,54,58)(H,55,59)(H,56,64)(H,62,63)/t39-,40-,41+,42+,43+/m1/s1
Reactome pathway
n/an/an/a 2.10n/an/an/an/an/a
Saga University
Curated by ChEMBL
Assay Description
Antagonist activity at formyl peptide receptor in human HL60 cells assessed as inhibition of intracellular calcium mobilization incubated for 5 mins ...
Bioorg Med Chem 22: 3824-8 (2014)
Article DOI: 10.1016/j.bmc.2014.06.048
BindingDB Entry DOI: 10.7270/Q28S4RK8