BDBM50051883 1-{5-[2-(4,5-Diphenyl-1H-imidazol-2-yl)-5-methyl-[1,3]dioxan-5-yl]-pentyl}-3,5-dimethyl-1H-pyrazole::CHEMBL285429
SMILES: Cc1cc(C)n(CCCCCC2(C)COC(OC2)c2nc(c([nH]2)-c2ccccc2)-c2ccccc2)n1
InChI Key: InChIKey=BOQCJNRJHSITES-UHFFFAOYSA-N
Data: 1 IC50
Activity Spreadsheet -- Enzyme Inhibition Constant Data from BindingDB
Found 1 hit for monomerid = 50051883
Trg + Lig
Ki
nM
ΔG°
kcal/mole
IC50
nM
Kd
nM
EC50/IC50
nM
koff
s-1
kon
M-1s-1
pHTemp
°C
Sterol O-acyltransferase 1
(Homo sapiens (Human))
BDBM50051883
(1-{5-[2-(4,5-Diphenyl-1H-imidazol-2-yl)-5-methyl-[...)
Show SMILES Cc1cc(C)n(CCCCCC2(C)COC(OC2)c2nc(c([nH]2)-c2ccccc2)-c2ccccc2)n1 |(10.96,-4.93,;10.8,-6.47,;9.47,-7.23,;9.8,-8.75,;8.77,-9.89,;11.34,-8.91,;12.12,-10.26,;11.03,-11.35,;11.8,-12.69,;11.05,-14.02,;11.83,-15.36,;11.84,-16.9,;13.17,-17.67,;11.08,-18.24,;9.36,-17.63,;8.18,-18.05,;8.94,-16.7,;10.57,-17.32,;6.84,-17.28,;6.43,-15.79,;4.9,-15.72,;4.34,-17.16,;5.55,-18.12,;2.85,-17.56,;1.77,-16.47,;.29,-16.88,;-.11,-18.37,;.99,-19.45,;2.47,-19.05,;4.04,-14.43,;4.74,-13.06,;3.9,-11.77,;2.36,-11.85,;1.68,-13.23,;2.52,-14.51,;11.96,-7.49,)|
Show InChI InChI=1S/C30H36N4O2/c1-22-19-23(2)34(33-22)18-12-6-11-17-30(3)20-35-29(36-21-30)28-31-26(24-13-7-4-8-14-24)27(32-28)25-15-9-5-10-16-25/h4-5,7-10,13-16,19,29H,6,11-12,17-18,20-21H2,1-3H3,(H,31,32)
n/an/a 60n/an/an/an/an/an/a
Rhône-Poulenc Rorer
Curated by ChEMBL
Assay Description
Inhibitory concentration of the compound was evaluated as concentration required to inhibit 50% of the activity of human Acyl coenzyme A:cholesterol ...
J Med Chem 39: 1423-32 (1996)
Article DOI: 10.1021/jm9505876
BindingDB Entry DOI: 10.7270/Q2TB160C