BDBM50052032 CHEMBL3322584
SMILES: COc1ccc(cc1)-c1c[nH]cc(C(=O)Nc2ccc3\C(=C\c4ccc[nH]4)C(=O)Nc3c2)c1=O
InChI Key: InChIKey=YTXBYKUQCJKNTG-JAIQZWGSSA-N
Data: 1 IC50
Activity Spreadsheet -- Enzyme Inhibition Constant Data from BindingDB
Found 1 hit for monomerid = 50052032
Trg + Lig
Ki
nM
ΔG°
kcal/mole
IC50
nM
Kd
nM
EC50/IC50
nM
koff
s-1
kon
M-1s-1
pHTemp
°C
Aurora kinase B
(Homo sapiens (Human))
BDBM50052032
(CHEMBL3322584)
Show SMILES COc1ccc(cc1)-c1c[nH]cc(C(=O)Nc2ccc3\C(=C\c4ccc[nH]4)C(=O)Nc3c2)c1=O
Show InChI InChI=1S/C26H20N4O4/c1-34-18-7-4-15(5-8-18)21-13-27-14-22(24(21)31)26(33)29-17-6-9-19-20(11-16-3-2-10-28-16)25(32)30-23(19)12-17/h2-14,28H,1H3,(H,27,31)(H,29,33)(H,30,32)/b20-11-
Reactome pathway
n/an/a 10n/an/an/an/an/an/a
National Taiwan University
Curated by ChEMBL
Assay Description
Inhibition of Aurora B (unknown origin) using H-LRRASLG substrate by radioisotope-based P81 filter-binding assay
Eur J Med Chem 84: 312-34 (2014)
Article DOI: 10.1016/j.ejmech.2014.07.033
BindingDB Entry DOI: 10.7270/Q2RV0QB7