BDBM50052045 5-(3-Methyl-but-2-enyl)-5-phenyl-6-oxa-10b-aza-benzo[e]azulen-4-one::CHEMBL330479
SMILES: [#6]\[#6](-[#6])=[#6]\[#6]C1([#8]-c2ccccc2-n2cccc2-[#6]1=O)c1ccccc1
InChI Key: InChIKey=IJGLPJRKFZJNCY-UHFFFAOYSA-N
Data: 1 IC50
Activity Spreadsheet -- Enzyme Inhibition Constant Data from BindingDB
Found 1 hit for monomerid = 50052045
Trg + Lig
Ki
nM
ΔG°
kcal/mole
IC50
nM
Kd
nM
EC50/IC50
nM
koff
s-1
kon
M-1s-1
pHTemp
°C
Human immunodeficiency virus type 1 reverse transcriptase
(Human immunodeficiency virus 1)
BDBM50052045
(5-(3-Methyl-but-2-enyl)-5-phenyl-6-oxa-10b-aza-ben...)
Show SMILES [#6]\[#6](-[#6])=[#6]\[#6]C1([#8]-c2ccccc2-n2cccc2-[#6]1=O)c1ccccc1
Show InChI InChI=1S/C23H21NO2/c1-17(2)14-15-23(18-9-4-3-5-10-18)22(25)20-12-8-16-24(20)19-11-6-7-13-21(19)26-23/h3-14,16H,15H2,1-2H3
n/an/a>5.00E+5n/an/an/an/an/an/a
Universitá di Siena
Curated by ChEMBL
Assay Description
Compound was tested for Inhibition of HIV-1 RT activity.
J Med Chem 39: 2672-80 (1996)
Article DOI: 10.1021/jm950702c
BindingDB Entry DOI: 10.7270/Q21R6PM4