BDBM50052058 10-Chloro-5-ethyl-5-phenyl-6-thia-10b-aza-benzo[e]azulen-4-one::CHEMBL316357
SMILES: CCC1(Sc2cccc(Cl)c2-n2cccc2C1=O)c1ccccc1
InChI Key: InChIKey=OKAFEYOTXFKGMK-UHFFFAOYSA-N
Data: 1 IC50
Activity Spreadsheet -- Enzyme Inhibition Constant Data from BindingDB
Found 1 hit for monomerid = 50052058
Trg + Lig
Ki
nM
ΔG°
kcal/mole
IC50
nM
Kd
nM
EC50/IC50
nM
koff
s-1
kon
M-1s-1
pHTemp
°C
Human immunodeficiency virus type 1 reverse transcriptase
(Human immunodeficiency virus 1)
BDBM50052058
(10-Chloro-5-ethyl-5-phenyl-6-thia-10b-aza-benzo[e]...)
Show SMILES CCC1(Sc2cccc(Cl)c2-n2cccc2C1=O)c1ccccc1
Show InChI InChI=1S/C20H16ClNOS/c1-2-20(14-8-4-3-5-9-14)19(23)16-11-7-13-22(16)18-15(21)10-6-12-17(18)24-20/h3-13H,2H2,1H3
n/an/a 6.00E+5n/an/an/an/an/an/a
Universitá di Siena
Curated by ChEMBL
Assay Description
Compound was tested for Inhibition of HIV-1 RT activity.
J Med Chem 39: 2672-80 (1996)
Article DOI: 10.1021/jm950702c
BindingDB Entry DOI: 10.7270/Q21R6PM4