BDBM50052071 CHEMBL3322591
SMILES: Cc1c[nH]cc(C(=O)Nc2ccc3\C(=C\c4ccc[nH]4)C(=O)Nc3c2)c1=O
InChI Key: InChIKey=SZOVVQDAANPUTI-CHHVJCJISA-N
Data: 1 IC50
Activity Spreadsheet -- Enzyme Inhibition Constant Data from BindingDB
Found 1 hit for monomerid = 50052071
Trg + Lig
Ki
nM
ΔG°
kcal/mole
IC50
nM
Kd
nM
EC50/IC50
nM
koff
s-1
kon
M-1s-1
pHTemp
°C
Aurora kinase B
(Homo sapiens (Human))
BDBM50052071
(CHEMBL3322591)
Show SMILES Cc1c[nH]cc(C(=O)Nc2ccc3\C(=C\c4ccc[nH]4)C(=O)Nc3c2)c1=O
Show InChI InChI=1S/C20H16N4O3/c1-11-9-21-10-16(18(11)25)20(27)23-13-4-5-14-15(7-12-3-2-6-22-12)19(26)24-17(14)8-13/h2-10,22H,1H3,(H,21,25)(H,23,27)(H,24,26)/b15-7-
Reactome pathway
n/an/a 29n/an/an/an/an/an/a
National Taiwan University
Curated by ChEMBL
Assay Description
Inhibition of Aurora B (unknown origin) using H-LRRASLG substrate by radioisotope-based P81 filter-binding assay
Eur J Med Chem 84: 312-34 (2014)
Article DOI: 10.1016/j.ejmech.2014.07.033
BindingDB Entry DOI: 10.7270/Q2RV0QB7