null
SMILES: [Cl-].ClCc1ccc(C[n+]2ccc(\C=C3\C(=O)Nc4ccccc34)cc2)cc1
InChI Key: InChIKey=LXCMYAUVBPCFEY-UHFFFAOYSA-O
Activity Spreadsheet -- Enzyme Inhibition Constant Data from BindingDB
Found 2 hits for monomerid = 50052202
Trg + Lig
Ki
nM
ΔG°
kcal/mole
IC50
nM
Kd
nM
EC50/IC50
nM
koff
s-1
kon
M-1s-1
pHTemp
°C
Acetylcholinesterase
(Electrophorus electricus (Electric eel))
BDBM50052202
(CHEMBL3318410)
Show SMILES [Cl-].ClCc1ccc(C[n+]2ccc(\C=C3\C(=O)Nc4ccccc34)cc2)cc1
Show InChI InChI=1S/C22H17ClN2O/c23-14-17-5-7-18(8-6-17)15-25-11-9-16(10-12-25)13-20-19-3-1-2-4-21(19)24-22(20)26/h1-13H,14-15H2/p+1
n/an/a 103n/an/an/an/an/an/a
Yazd University
Curated by ChEMBL
Assay Description
Inhibition of electric eel AChE using acetylthiocholine iodide substrate by Ellman method based spectrophotometry
Eur J Med Chem 84: 375-81 (2014)
Article DOI: 10.1016/j.ejmech.2014.01.017
BindingDB Entry DOI: 10.7270/Q2H996T1
Cholinesterase
(Equus caballus (Horse))
BDBM50052202
(CHEMBL3318410)
Show SMILES [Cl-].ClCc1ccc(C[n+]2ccc(\C=C3\C(=O)Nc4ccccc34)cc2)cc1
Show InChI InChI=1S/C22H17ClN2O/c23-14-17-5-7-18(8-6-17)15-25-11-9-16(10-12-25)13-20-19-3-1-2-4-21(19)24-22(20)26/h1-13H,14-15H2/p+1
n/an/a 1.00E+3n/an/an/an/an/an/a
Yazd University
Curated by ChEMBL
Assay Description
Inhibition of equine serum BuChE using butyrylthiocholine iodide substrate by Ellman method based spectrophotometry
Eur J Med Chem 84: 375-81 (2014)
Article DOI: 10.1016/j.ejmech.2014.01.017
BindingDB Entry DOI: 10.7270/Q2H996T1