null
SMILES: [Cl-].COc1cccc(C[n+]2ccc(\C=C3\C(=O)Nc4ccccc34)cc2)c1
InChI Key: InChIKey=QKQIGHNZOKXRPS-UHFFFAOYSA-N
Activity Spreadsheet -- Enzyme Inhibition Constant Data from BindingDB
Found 2 hits for monomerid = 50052215
Trg + Lig
Ki
nM
ΔG°
kcal/mole
IC50
nM
Kd
nM
EC50/IC50
nM
koff
s-1
kon
M-1s-1
pHTemp
°C
Cholinesterase
(Equus caballus (Horse))
BDBM50052215
(CHEMBL3318403)
Show SMILES [Cl-].COc1cccc(C[n+]2ccc(\C=C3\C(=O)Nc4ccccc34)cc2)c1
Show InChI InChI=1S/C22H18N2O2.ClH/c1-26-18-6-4-5-17(13-18)15-24-11-9-16(10-12-24)14-20-19-7-2-3-8-21(19)23-22(20)25;/h2-14H,15H2,1H3;1H
n/an/a 2.80E+3n/an/an/an/an/an/a
Yazd University
Curated by ChEMBL
Assay Description
Inhibition of equine serum BuChE using butyrylthiocholine iodide substrate by Ellman method based spectrophotometry
Eur J Med Chem 84: 375-81 (2014)
Article DOI: 10.1016/j.ejmech.2014.01.017
BindingDB Entry DOI: 10.7270/Q2H996T1
Acetylcholinesterase
(Electrophorus electricus (Electric eel))
BDBM50052215
(CHEMBL3318403)
Show SMILES [Cl-].COc1cccc(C[n+]2ccc(\C=C3\C(=O)Nc4ccccc34)cc2)c1
Show InChI InChI=1S/C22H18N2O2.ClH/c1-26-18-6-4-5-17(13-18)15-24-11-9-16(10-12-24)14-20-19-7-2-3-8-21(19)23-22(20)25;/h2-14H,15H2,1H3;1H
n/an/a 6.60n/an/an/an/an/an/a
Yazd University
Curated by ChEMBL
Assay Description
Inhibition of electric eel AChE using acetylthiocholine iodide substrate by Ellman method based spectrophotometry
Eur J Med Chem 84: 375-81 (2014)
Article DOI: 10.1016/j.ejmech.2014.01.017
BindingDB Entry DOI: 10.7270/Q2H996T1