BDBM50052357 3-Biphenyl-4-ylmethyl-1-aza-bicyclo[2.2.2]octane::3-[1'-(Biphenyl)-methyl]-quinuclidine::CHEMBL99679
SMILES: C(C1CN2CCC1CC2)c1ccc(cc1)-c1ccccc1
InChI Key: InChIKey=QBLZXWRXSWVMCP-UHFFFAOYSA-N
Data: 2 IC50
Activity Spreadsheet -- Enzyme Inhibition Constant Data from BindingDB
Found 2 hits for monomerid = 50052357
Trg + Lig
Ki
nM
ΔG°
kcal/mole
IC50
nM
Kd
nM
EC50/IC50
nM
koff
s-1
kon
M-1s-1
pHTemp
°C
Farnesyltransferase, putative
(Leishmania major)
BDBM50052357
(3-Biphenyl-4-ylmethyl-1-aza-bicyclo[2.2.2]octane |...)
Show SMILES C(C1CN2CCC1CC2)c1ccc(cc1)-c1ccccc1 |(24.24,-17.57,;22.91,-18.33,;22.91,-19.88,;21.57,-20.65,;20.23,-19.88,;20.23,-18.33,;21.57,-17.56,;20.83,-18.92,;22.32,-19.32,;25.58,-18.34,;25.57,-19.88,;26.9,-20.64,;28.23,-19.88,;28.23,-18.33,;26.9,-17.57,;29.56,-20.64,;29.56,-22.19,;30.89,-22.96,;32.23,-22.19,;32.22,-20.64,;30.89,-19.88,)|
Show InChI InChI=1S/C20H23N/c1-2-4-17(5-3-1)18-8-6-16(7-9-18)14-20-15-21-12-10-19(20)11-13-21/h1-9,19-20H,10-15H2
n/an/a>1.00E+3n/an/an/an/an/an/a
Cardiff University
Curated by ChEMBL
Assay Description
Inhibition of Leishmania major recombinant squalene synthase expressed in Escherichia coli by liquid scintillation counter
Antimicrob Agents Chemother 51: 4049-61 (2007)
Article DOI: 10.1128/AAC.00205-07
BindingDB Entry DOI: 10.7270/Q2MS3SJZ
Squalene synthetase
(Rattus norvegicus)
BDBM50052357
(3-Biphenyl-4-ylmethyl-1-aza-bicyclo[2.2.2]octane |...)
Show SMILES C(C1CN2CCC1CC2)c1ccc(cc1)-c1ccccc1 |(24.24,-17.57,;22.91,-18.33,;22.91,-19.88,;21.57,-20.65,;20.23,-19.88,;20.23,-18.33,;21.57,-17.56,;20.83,-18.92,;22.32,-19.32,;25.58,-18.34,;25.57,-19.88,;26.9,-20.64,;28.23,-19.88,;28.23,-18.33,;26.9,-17.57,;29.56,-20.64,;29.56,-22.19,;30.89,-22.96,;32.23,-22.19,;32.22,-20.64,;30.89,-19.88,)|
Show InChI InChI=1S/C20H23N/c1-2-4-17(5-3-1)18-8-6-16(7-9-18)14-20-15-21-12-10-19(20)11-13-21/h1-9,19-20H,10-15H2
Reactome pathway
n/an/a 27n/an/an/an/an/an/a
Zeneca Pharmaceuticals
Curated by ChEMBL
Assay Description
In vitro inhibition against rat microsomal squalene synthase (SS)
J Med Chem 39: 2971-9 (1996)
Article DOI: 10.1021/jm950907l
BindingDB Entry DOI: 10.7270/Q24J0D7G