BDBM50052358 3-(Biphenyl-4-yloxymethyl)-1-aza-bicyclo[2.2.2]octan-3-ol::CHEMBL101492
SMILES: OC1(COc2ccc(cc2)-c2ccccc2)CN2CCC1CC2
InChI Key: InChIKey=DIAZCVPBGMQKAD-UHFFFAOYSA-N
Data: 1 IC50
Activity Spreadsheet -- Enzyme Inhibition Constant Data from BindingDB
Found 1 hit for monomerid = 50052358
Trg + Lig
Ki
nM
ΔG°
kcal/mole
IC50
nM
Kd
nM
EC50/IC50
nM
koff
s-1
kon
M-1s-1
pHTemp
°C
Squalene synthetase
(Rattus norvegicus)
BDBM50052358
(3-(Biphenyl-4-yloxymethyl)-1-aza-bicyclo[2.2.2]oct...)
Show SMILES OC1(COc2ccc(cc2)-c2ccccc2)CN2CCC1CC2 |THB:2:1:21.22:19.18,0:1:21.22:19.18,(12.09,-8,;11.74,-9.89,;13.28,-9.89,;14.12,-11.17,;15.68,-11.08,;16.49,-12.37,;18.05,-12.29,;18.73,-10.91,;17.89,-9.61,;16.35,-9.71,;20.26,-10.8,;21.13,-12.09,;22.66,-12.01,;23.36,-10.63,;22.5,-9.34,;20.96,-9.44,;12.05,-11.4,;10.56,-10.7,;8.88,-11.43,;8.67,-9.93,;10.28,-9.23,;10.28,-7.38,;10.84,-8.64,)|
Show InChI InChI=1S/C20H23NO2/c22-20(14-21-12-10-18(20)11-13-21)15-23-19-8-6-17(7-9-19)16-4-2-1-3-5-16/h1-9,18,22H,10-15H2
Reactome pathway
n/an/a 13n/an/an/an/an/an/a
Zeneca Pharmaceuticals
Curated by ChEMBL
Assay Description
In vitro inhibition against rat microsomal squalene synthase (SS)
J Med Chem 39: 2971-9 (1996)
Article DOI: 10.1021/jm950907l
BindingDB Entry DOI: 10.7270/Q24J0D7G