null
SMILES: CSCC[C@H](NC(=O)[C@H](CC(C)C)NC(=O)CN1CCCNC(=O)CCC(=O)N[C@@H](CCCNC(N)=N)C(=O)N[C@H](Cc2ccccc2)C(=O)N[C@@H](Cc2ccccc2)C1=O)C(N)=O
InChI Key: InChIKey=ZFMPRZDNGINSND-ISWDJSIVSA-N
Activity Spreadsheet -- Enzyme Inhibition Constant Data from BindingDB
Found 3 hits for monomerid = 50052522
Trg + Lig
Ki
nM
ΔG°
kcal/mole
IC50
nM
Kd
nM
EC50/IC50
nM
koff
s-1
kon
M-1s-1
pHTemp
°C
Substance-K receptor
(Rattus norvegicus (Rat))
BDBM50052522
((S)-2-{2-[(2S,5R,8S)-5,8-Dibenzyl-2-(3-guanidino-p...)
Show SMILES CSCC[C@H](NC(=O)[C@H](CC(C)C)NC(=O)CN1CCCNC(=O)CCC(=O)N[C@@H](CCCNC(N)=N)C(=O)N[C@H](Cc2ccccc2)C(=O)N[C@@H](Cc2ccccc2)C1=O)C(N)=O
Show InChI InChI=1S/C44H65N11O8S/c1-28(2)24-33(41(61)52-31(39(45)59)19-23-64-3)51-38(58)27-55-22-11-21-48-36(56)17-18-37(57)50-32(16-10-20-49-44(46)47)40(60)53-34(25-29-12-6-4-7-13-29)42(62)54-35(43(55)63)26-30-14-8-5-9-15-30/h4-9,12-15,28,31-35H,10-11,16-27H2,1-3H3,(H2,45,59)(H,48,56)(H,50,57)(H,51,58)(H,52,61)(H,53,60)(H,54,62)(H4,46,47,49)/t31-,32-,33-,34+,35-/m0/s1
Reactome pathway
n/an/an/an/a>5.00E+4n/an/an/an/a
Hebrew University of Jerusalem
Curated by ChEMBL
Assay Description
Effective concentration to activate Tachykinin receptor 2 in rat vas deferens (RVD)
J Med Chem 39: 3174-8 (1996)
Article DOI: 10.1021/jm960154i
BindingDB Entry DOI: 10.7270/Q27943SZ
Substance-P receptor
(GUINEA PIG)
BDBM50052522
((S)-2-{2-[(2S,5R,8S)-5,8-Dibenzyl-2-(3-guanidino-p...)
Show SMILES CSCC[C@H](NC(=O)[C@H](CC(C)C)NC(=O)CN1CCCNC(=O)CCC(=O)N[C@@H](CCCNC(N)=N)C(=O)N[C@H](Cc2ccccc2)C(=O)N[C@@H](Cc2ccccc2)C1=O)C(N)=O
Show InChI InChI=1S/C44H65N11O8S/c1-28(2)24-33(41(61)52-31(39(45)59)19-23-64-3)51-38(58)27-55-22-11-21-48-36(56)17-18-37(57)50-32(16-10-20-49-44(46)47)40(60)53-34(25-29-12-6-4-7-13-29)42(62)54-35(43(55)63)26-30-14-8-5-9-15-30/h4-9,12-15,28,31-35H,10-11,16-27H2,1-3H3,(H2,45,59)(H,48,56)(H,50,57)(H,51,58)(H,52,61)(H,53,60)(H,54,62)(H4,46,47,49)/t31-,32-,33-,34+,35-/m0/s1
n/an/an/an/a 180n/an/an/an/a
Hebrew University of Jerusalem
Curated by ChEMBL
Assay Description
Effective concentration to activate Tachykinin receptor 1 in guinea pig ileum(GPI)
J Med Chem 39: 3174-8 (1996)
Article DOI: 10.1021/jm960154i
BindingDB Entry DOI: 10.7270/Q27943SZ
Neuromedin-K receptor
(Rattus norvegicus)
BDBM50052522
((S)-2-{2-[(2S,5R,8S)-5,8-Dibenzyl-2-(3-guanidino-p...)
Show SMILES CSCC[C@H](NC(=O)[C@H](CC(C)C)NC(=O)CN1CCCNC(=O)CCC(=O)N[C@@H](CCCNC(N)=N)C(=O)N[C@H](Cc2ccccc2)C(=O)N[C@@H](Cc2ccccc2)C1=O)C(N)=O
Show InChI InChI=1S/C44H65N11O8S/c1-28(2)24-33(41(61)52-31(39(45)59)19-23-64-3)51-38(58)27-55-22-11-21-48-36(56)17-18-37(57)50-32(16-10-20-49-44(46)47)40(60)53-34(25-29-12-6-4-7-13-29)42(62)54-35(43(55)63)26-30-14-8-5-9-15-30/h4-9,12-15,28,31-35H,10-11,16-27H2,1-3H3,(H2,45,59)(H,48,56)(H,50,57)(H,51,58)(H,52,61)(H,53,60)(H,54,62)(H4,46,47,49)/t31-,32-,33-,34+,35-/m0/s1
Reactome pathway
n/an/an/an/a>1.00E+4n/an/an/an/a
Hebrew University of Jerusalem
Curated by ChEMBL
Assay Description
Effective concentration to activate Tachykinin receptor 3 in rat portal vein (RPV)
J Med Chem 39: 3174-8 (1996)
Article DOI: 10.1021/jm960154i
BindingDB Entry DOI: 10.7270/Q27943SZ