BDBM50052748 Acetic acid 5-phenyl-6-oxa-10b-aza-benzo[e]azulen-4-yl ester::CHEMBL326943
SMILES: CC(=O)OC1=C(Oc2ccccc2-n2cccc12)c1ccccc1
InChI Key: InChIKey=RZMVXAUMXBNRMO-UHFFFAOYSA-N
Data: 1 KI  1 IC50
Activity Spreadsheet -- Enzyme Inhibition Constant Data from BindingDB
Found 2 hits for monomerid = 50052748
Trg + Lig
Ki
nM
ΔG°
kcal/mole
IC50
nM
Kd
nM
EC50/IC50
nM
koff
s-1
kon
M-1s-1
pHTemp
°C
Peripheral-Type Benzodiazepine Receptor
(Rattus norvegicus (rat))
BDBM50052748
(Acetic acid 5-phenyl-6-oxa-10b-aza-benzo[e]azulen-...)
Show SMILES CC(=O)OC1=C(Oc2ccccc2-n2cccc12)c1ccccc1 |t:4|
Show InChI InChI=1S/C20H15NO3/c1-14(22)23-20-17-11-7-13-21(17)16-10-5-6-12-18(16)24-19(20)15-8-3-2-4-9-15/h2-13H,1H3
4.70n/an/an/an/an/an/an/an/a
Universit£ di Siena
Curated by ChEMBL
Assay Description
Binding affinity against peripheral-type benzodiazepine receptor (PBR) from rat cortex homogenate using [3H]-PK 11195 as radioligand
J Med Chem 39: 3435-50 (1996)
Article DOI: 10.1021/jm960251b
BindingDB Entry DOI: 10.7270/Q23B60SK
Peripheral-Type Benzodiazepine Receptor
(Rattus norvegicus (rat))
BDBM50052748
(Acetic acid 5-phenyl-6-oxa-10b-aza-benzo[e]azulen-...)
Show SMILES CC(=O)OC1=C(Oc2ccccc2-n2cccc12)c1ccccc1 |t:4|
Show InChI InChI=1S/C20H15NO3/c1-14(22)23-20-17-11-7-13-21(17)16-10-5-6-12-18(16)24-19(20)15-8-3-2-4-9-15/h2-13H,1H3
n/an/a 12n/an/an/an/an/an/a
Universit£ di Siena
Curated by ChEMBL
Assay Description
Inhibition of binding of [3H]-PK 11195 to peripheral-type benzodiazepine receptor (PBR) from rat cortex homogenate
J Med Chem 39: 3435-50 (1996)
Article DOI: 10.1021/jm960251b
BindingDB Entry DOI: 10.7270/Q23B60SK