BDBM50053223 CHEMBL3318781
SMILES: CN1CCN(CC1)S(=O)(=O)C[C@@H](N1[C@@H]([C@H](C[C@](C)(CC(O)=O)C1=O)c1cccc(Cl)c1)c1ccc(Cl)cc1)C(C)(C)C
InChI Key: InChIKey=OUIXNKJJQLNOMA-IAHIMPAPSA-N
Data: 1 IC50
Activity Spreadsheet -- Enzyme Inhibition Constant Data from BindingDB
Found 1 hit for monomerid = 50053223
Trg + Lig
Ki
nM
ΔG°
kcal/mole
IC50
nM
Kd
nM
EC50/IC50
nM
koff
s-1
kon
M-1s-1
pHTemp
°C
MDM2-MDMX
(Homo sapiens (Human))
BDBM50053223
(CHEMBL3318781)
Show SMILES CN1CCN(CC1)S(=O)(=O)C[C@@H](N1[C@@H]([C@H](C[C@](C)(CC(O)=O)C1=O)c1cccc(Cl)c1)c1ccc(Cl)cc1)C(C)(C)C |r|
Show InChI InChI=1S/C31H41Cl2N3O5S/c1-30(2,3)26(20-42(40,41)35-15-13-34(5)14-16-35)36-28(21-9-11-23(32)12-10-21)25(22-7-6-8-24(33)17-22)18-31(4,29(36)39)19-27(37)38/h6-12,17,25-26,28H,13-16,18-20H2,1-5H3,(H,37,38)/t25-,26-,28-,31-/m1/s1
NCI pathway
Reactome pathway
n/an/a 0.0740n/an/an/an/an/an/a
Amgen Inc.
Curated by ChEMBL
Assay Description
Binding affinity to human GST-thrombin-tagged MDM2 assessed as inhibition of interaction with human p53 after 1 hr by HTRF assay in presence of 15% h...
Bioorg Med Chem Lett 24: 3782-5 (2014)
Article DOI: 10.1016/j.bmcl.2014.06.073
BindingDB Entry DOI: 10.7270/Q2ZC84HH