BDBM50053232 CHEMBL3330235
SMILES: Cc1cc2c(NC3CCNC3)c(-c3nc4ccccc4[nH]3)c(=O)[nH]c2s1
InChI Key: InChIKey=HLDBXBPGSYFYTE-UHFFFAOYSA-N
Data: 1 IC50
Activity Spreadsheet -- Enzyme Inhibition Constant Data from BindingDB
Found 1 hit for monomerid = 50053232
Trg + Lig
Ki
nM
ΔG°
kcal/mole
IC50
nM
Kd
nM
EC50/IC50
nM
koff
s-1
kon
M-1s-1
pHTemp
°C
Serine/threonine-protein kinase Chk1
(Homo sapiens (Human))
BDBM50053232
(CHEMBL3330235)
Show SMILES Cc1cc2c(NC3CCNC3)c(-c3nc4ccccc4[nH]3)c(=O)[nH]c2s1
Show InChI InChI=1S/C19H19N5OS/c1-10-8-12-16(21-11-6-7-20-9-11)15(18(25)24-19(12)26-10)17-22-13-4-2-3-5-14(13)23-17/h2-5,8,11,20H,6-7,9H2,1H3,(H,22,23)(H2,21,24,25)
Reactome pathway
n/an/a 23n/an/an/an/an/an/a
Zhejiang University
Curated by ChEMBL
Assay Description
Inhibition of Chk1 (unknown origin) by luminescent ADP-Glo assay
Bioorg Med Chem 22: 4882-92 (2014)
Article DOI: 10.1016/j.bmc.2014.06.044
BindingDB Entry DOI: 10.7270/Q2TM7CRB