BDBM50053251 CHEMBL3330141
SMILES: CN(C)CCNc1c(-c2nc3ccccc3[nH]2)c(=O)[nH]c2sccc12
InChI Key: InChIKey=PUXHRNVJEJFFSZ-UHFFFAOYSA-N
Data: 1 IC50
Activity Spreadsheet -- Enzyme Inhibition Constant Data from BindingDB
Found 1 hit for monomerid = 50053251
Trg + Lig
Ki
nM
ΔG°
kcal/mole
IC50
nM
Kd
nM
EC50/IC50
nM
koff
s-1
kon
M-1s-1
pHTemp
°C
Serine/threonine-protein kinase Chk1
(Homo sapiens (Human))
BDBM50053251
(CHEMBL3330141)
Show SMILES CN(C)CCNc1c(-c2nc3ccccc3[nH]2)c(=O)[nH]c2sccc12
Show InChI InChI=1S/C18H19N5OS/c1-23(2)9-8-19-15-11-7-10-25-18(11)22-17(24)14(15)16-20-12-5-3-4-6-13(12)21-16/h3-7,10H,8-9H2,1-2H3,(H,20,21)(H2,19,22,24)
Reactome pathway
n/an/a 178n/an/an/an/an/an/a
Zhejiang University
Curated by ChEMBL
Assay Description
Inhibition of Chk1 (unknown origin) by luminescent ADP-Glo assay
Bioorg Med Chem 22: 4882-92 (2014)
Article DOI: 10.1016/j.bmc.2014.06.044
BindingDB Entry DOI: 10.7270/Q2TM7CRB