BDBM50053300 CHEMBL3323025
SMILES: Cc1cccc(c1)-c1cn(nn1)-c1ccc(O)c(c1)C(=O)Nc1cccc(c1)C(F)(F)F
InChI Key: InChIKey=ULYHOTNHXDNDAI-UHFFFAOYSA-N
Data: 1 IC50
Activity Spreadsheet -- Enzyme Inhibition Constant Data from BindingDB
Found 1 hit for monomerid = 50053300
Trg + Lig
Ki
nM
ΔG°
kcal/mole
IC50
nM
Kd
nM
EC50/IC50
nM
koff
s-1
kon
M-1s-1
pHTemp
°C
Aurora kinase A
(Homo sapiens (Human))
BDBM50053300
(CHEMBL3323025)
Show SMILES Cc1cccc(c1)-c1cn(nn1)-c1ccc(O)c(c1)C(=O)Nc1cccc(c1)C(F)(F)F
Show InChI InChI=1S/C23H17F3N4O2/c1-14-4-2-5-15(10-14)20-13-30(29-28-20)18-8-9-21(31)19(12-18)22(32)27-17-7-3-6-16(11-17)23(24,25)26/h2-13,31H,1H3,(H,27,32)
NCI pathway
Reactome pathway
n/an/a 3.83E+3n/an/an/an/an/an/a
Ewha Womans University
Curated by ChEMBL
Assay Description
Inhibition of Aurora A (unknown origin) using [33P]-ATP and 10 uM ATP after 2 hrs
Bioorg Med Chem 22: 4855-66 (2014)
Article DOI: 10.1016/j.bmc.2014.06.047
BindingDB Entry DOI: 10.7270/Q2PV6N11