BDBM50053343 CHEMBL3330271
SMILES: NS(=O)(=O)c1cccc(c1)-c1n[nH]c2ccc(NC(=O)Cc3ccncc3)cc12
InChI Key: InChIKey=YIBVYYNEYWFFKM-UHFFFAOYSA-N
Data: 1 IC50
Activity Spreadsheet -- Enzyme Inhibition Constant Data from BindingDB
Found 1 hit for monomerid = 50053343
Trg + Lig
Ki
nM
ΔG°
kcal/mole
IC50
nM
Kd
nM
EC50/IC50
nM
koff
s-1
kon
M-1s-1
pHTemp
°C
Dual specificity protein kinase TTK
(Homo sapiens (Human))
BDBM50053343
(CHEMBL3330271)
Show SMILES NS(=O)(=O)c1cccc(c1)-c1n[nH]c2ccc(NC(=O)Cc3ccncc3)cc12
Show InChI InChI=1S/C20H17N5O3S/c21-29(27,28)16-3-1-2-14(11-16)20-17-12-15(4-5-18(17)24-25-20)23-19(26)10-13-6-8-22-9-7-13/h1-9,11-12H,10H2,(H,23,26)(H,24,25)(H2,21,27,28)
n/an/a 340n/an/an/an/an/an/a
University Health Network
Curated by ChEMBL
Assay Description
Inhibition of SUMO-tagged human TTK (1-275 residues) compound pre-incubated for 15 mins prior ATP addition by MBP-based assay
Bioorg Med Chem 22: 4968-97 (2014)
Article DOI: 10.1016/j.bmc.2014.06.027
BindingDB Entry DOI: 10.7270/Q2K35WB2